{"text_format":"1","workbook":"xlsx","n_sheets":4,"sheets":["Erfassung","Feiertage und Ferien","Arbeitszeiten","Arbeitstage"],"not_rendered":{"charts":0,"images":0,"macros":0,"external_links":0,"defined_names":57,"comments":0,"pivot_tables":0},"unopened":[],"bounds":{"document_bytes":16777216,"sheet_cells":100000,"rows_first":2000,"rows_last":500,"rows_between":2000,"halvings":0,"cell_chars":16384,"cell_head_chars":4096},"cells_cut":0,"cells_raw":0,"read":"whole","date_system":"1900"}

{"sheet":"Erfassung","index":0,"n_rows":28,"n_cols":19,"rows_kept":28,"cut":false,"hidden":false,"merged":[[18,6,18,8],[5,6,6,17],[17,3,17,4],[14,3,16,4],[0,3,0,4],[1,3,1,4],[11,1,11,4],[12,1,13,4],[5,1,6,2],[12,6,13,17],[17,6,17,8]]}
["Jahr","Wochenarbeitszeit","Prozent alle Mt","Ferientage im Jahr",null,null,"Jan","Feb","März","Apr","Mai","Juni","Juli","Aug","Sept","Okt","Nov","Dez"]
[2025,42,0.8,25,null,null,{"$f":"$C$2","v":0.8},0.8,0.8,0.8,0.8,0.8,0.8,{"$f":"$C$2","v":0.8},0.8,0.8,0.8,0.8]
[null,"*die hellgrauen Werte können übertragen bzw. einzeln rausgelöschtwerden, die weiss hinterlegten Werte können angepasst werden."]
[]
[null,"Arbeitszeiten",null,null,null,null,"Arbeitstage"]
[null,"im ssa-app oder DossierManager unter Administration, Arbeitszeiten eintragen:",null,null,null,null,"im ssa-app oder DossierManager unter Administration, Arbeitstage eintragen:"]
{"$rows_left_out":23}
{"sheet":"Feiertage und Ferien","index":1,"n_rows":17,"n_cols":9,"rows_kept":17,"cut":false,"hidden":false,"merged":[[1,5,2,8]]}
["Datum","Feiertag"]
["2025-01-01","Neujahrstag",null,null,null,"zu den Resultaten"]
["2025-01-02","Berchtoldstag (statt 1. Mai = gleiches Resultat)"]
["2025-04-18","Karfreitag"]
["2025-04-21","Ostermontag"]
["2025-05-29","Auffahrt",null,null,null,"Ferienplan (nur für Berechnung Arbeitstage relevant):"]
{"$rows_left_out":12}
{"sheet":"Arbeitszeiten","index":2,"n_rows":44,"n_cols":37,"rows_kept":44,"cut":false,"hidden":false,"merged":[[1,35,1,36],[36,0,37,0],[9,0,10,0],[6,0,7,0],[12,0,13,0],[15,0,16,0],[33,0,34,0],[18,0,19,0],[21,0,22,0],[24,0,25,0],[27,0,28,0],[30,0,31,0],[3,0,4,0]]}
["Arbeitszeiten"]
[2025,1,2,3,4,5,6,7,8,9,10,11,12,13,14,15,16,17,18,19,20,21,22,23,24,25,26,27,28,29,30,31,"F Tage","Ferien h","A-Tage","Monatssaldo"]
[null,"2025-01-01",{"$f":"B3+1","v":"2025-01-02"},{"$f":"C3+1","v":"2025-01-03"},"2025-01-04","2025-01-05","2025-01-06","2025-01-07","2025-01-08","2025-01-09","2025-01-10","2025-01-11","2025-01-12","2025-01-13","2025-01-14","2025-01-15","2025-01-16","2025-01-17","2025-01-18","2025-01-19","2025-01-20","2025-01-21","2025-01-22","2025-01-23","2025-01-24","2025-01-25","2025-01-26","2025-01-27","2025-01-28","2025-01-29","2025-01-30","2025-01-31"]
["Januar",{"$f":"IF(ISNA(VLOOKUP(B3,'Feiertage und Ferien'!$A:$D,3,FALSE)),IF(OR(WEEKDAY(B3)=1,WEEKDAY(B3)=7),\"\",Erfassung!$B$2*SUM(Erfassung!$G$2:$G$2)/5),\"F\")","v":"F"},{"$f":"IF(ISNA(VLOOKUP(C3,'Feiertage und Ferien'!$A:$D,3,FALSE)),IF(OR(WEEKDAY(C3)=1,WEEKDAY(C3)=7),\"\",Erfassung!$B$2*SUM(Erfassung!$G$2:$G$2)/5),\"F\")","v":"F"},{"$f":"IF(ISNA(VLOOKUP(D3,'Feiertage und Ferien'!$A:$D,3,FALSE)),IF(OR(WEEKDAY(D3)=1,WEEKDAY(D3)=7),\"\",Erfassung!$B$2*SUM(Erfassung!$G$2:$G$2)/5),\"F\")","v":6.7200000000000006},{"$f":"IF(ISNA(VLOOKUP(E3,'Feiertage und Ferien'!$A:$D,3,FALSE)),IF(OR(WEEKDAY(E3)=1,WEEKDAY(E3)=7),\"\",Erfassung!$B$2*SUM(Erfassung!$G$2:$G$2)/5),\"F\")","v":""},{"$f":"IF(ISNA(VLOOKUP(F3,'Feiertage und Ferien'!$A:$D,3,FALSE)),IF(OR(WEEKDAY(F3)=1,WEEKDAY(F3)=7),\"\",Erfassung!$B$2*SUM(Erfassung!$G$2:$G$2)/5),\"F\")","v":""},{"$f":"IF(ISNA(VLOOKUP(G3,'Feiertage und Ferien'!$A:$D,3,FALSE)),IF(OR(WEEKDAY(G3)=1,WEEKDAY(G3)=7),\"\",Erfassung!$B$2*SUM(Erfassung!$G$2:$G$2)/5),\"F\")","v":6.7200000000000006},{"$f":"IF(ISNA(VLOOKUP(H3,'Feiertage und Ferien'!$A:$D,3,FALSE)),IF(OR(WEEKDAY(H3)=1,WEEKDAY(H3)=7),\"\",Erfassung!$B$2*SUM(Erfassung!$G$2:$G$2)/5),\"F\")","v":6.7200000000000006},{"$f":"IF(ISNA(VLOOKUP(I3,'Feiertage und Ferien'!$A:$D,3,FALSE)),IF(OR(WEEKDAY(I3)=1,WEEKDAY(I3)=7),\"\",Erfassung!$B$2*SUM(Erfassung!$G$2:$G$2)/5),\"F\")","v":6.7200000000000006},{"$f":"IF(ISNA(VLOOKUP(J3,'Feiertage und Ferien'!$A:$D,3,FALSE)),IF(OR(WEEKDAY(J3)=1,WEEKDAY(J3)=7),\"\",Erfassung!$B$2*SUM(Erfassung!$G$2:$G$2)/5),\"F\")","v":6.7200000000000006},{"$f":"IF(ISNA(VLOOKUP(K3,'Feiertage und Ferien'!$A:$D,3,FALSE)),IF(OR(WEEKDAY(K3)=1,WEEKDAY(K3)=7),\"\",Erfassung!$B$2*SUM(Erfassung!$G$2:$G$2)/5),\"F\")","v":6.7200000000000006},{"$f":"IF(ISNA(VLOOKUP(L3,'Feiertage und Ferien'!$A:$D,3,FALSE)),IF(OR(WEEKDAY(L3)=1,WEEKDAY(L3)=7),\"\",Erfassung!$B$2*SUM(Erfassung!$G$2:$G$2)/5),\"F\")","v":""},{"$f":"IF(ISNA(VLOOKUP(M3,'Feiertage und Ferien'!$A:$D,3,FALSE)),IF(OR(WEEKDAY(M3)=1,WEEKDAY(M3)=7),\"\",Erfassung!$B$2*SUM(Erfassung!$G$2:$G$2)/5),\"F\")","v":""},{"$f":"IF(ISNA(VLOOKUP(N3,'Feiertage und Ferien'!$A:$D,3,FALSE)),IF(OR(WEEKDAY(N3)=1,WEEKDAY(N3)=7),\"\",Erfassung!$B$2*SUM(Erfassung!$G$2:$G$2)/5),\"F\")","v":6.7200000000000006},{"$f":"IF(ISNA(VLOOKUP(O3,'Feiertage und Ferien'!$A:$D,3,FALSE)),IF(OR(WEEKDAY(O3)=1,WEEKDAY(O3)=7),\"\",Erfassung!$B$2*SUM(Erfassung!$G$2:$G$2)/5),\"F\")","v":6.7200000000000006},{"$f":"IF(ISNA(VLOOKUP(P3,'Feiertage und Ferien'!$A:$D,3,FALSE)),IF(OR(WEEKDAY(P3)=1,WEEKDAY(P3)=7),\"\",Erfassung!$B$2*SUM(Erfassung!$G$2:$G$2)/5),\"F\")","v":6.7200000000000006},{"$f":"IF(ISNA(VLOOKUP(Q3,'Feiertage und Ferien'!$A:$D,3,FALSE)),IF(OR(WEEKDAY(Q3)=1,WEEKDAY(Q3)=7),\"\",Erfassung!$B$2*SUM(Erfassung!$G$2:$G$2)/5),\"F\")","v":6.7200000000000006},{"$f":"IF(ISNA(VLOOKUP(R3,'Feiertage und Ferien'!$A:$D,3,FALSE)),IF(OR(WEEKDAY(R3)=1,WEEKDAY(R3)=7),\"\",Erfassung!$B$2*SUM(Erfassung!$G$2:$G$2)/5),\"F\")","v":6.7200000000000006},{"$f":"IF(ISNA(VLOOKUP(S3,'Feiertage und Ferien'!$A:$D,3,FALSE)),IF(OR(WEEKDAY(S3)=1,WEEKDAY(S3)=7),\"\",Erfassung!$B$2*SUM(Erfassung!$G$2:$G$2)/5),\"F\")","v":""},{"$f":"IF(ISNA(VLOOKUP(T3,'Feiertage und Ferien'!$A:$D,3,FALSE)),IF(OR(WEEKDAY(T3)=1,WEEKDAY(T3)=7),\"\",Erfassung!$B$2*SUM(Erfassung!$G$2:$G$2)/5),\"F\")","v":""},{"$f":"IF(ISNA(VLOOKUP(U3,'Feiertage und Ferien'!$A:$D,3,FALSE)),IF(OR(WEEKDAY(U3)=1,WEEKDAY(U3)=7),\"\",Erfassung!$B$2*SUM(Erfassung!$G$2:$G$2)/5),\"F\")","v":6.7200000000000006},{"$f":"IF(ISNA(VLOOKUP(V3,'Feiertage und Ferien'!$A:$D,3,FALSE)),IF(OR(WEEKDAY(V3)=1,WEEKDAY(V3)=7),\"\",Erfassung!$B$2*SUM(Erfassung!$G$2:$G$2)/5),\"F\")","v":6.7200000000000006},{"$f":"IF(ISNA(VLOOKUP(W3,'Feiertage und Ferien'!$A:$D,3,FALSE)),IF(OR(WEEKDAY(W3)=1,WEEKDAY(W3)=7),\"\",Erfassung!$B$2*SUM(Erfassung!$G$2:$G$2)/5),\"F\")","v":6.7200000000000006},{"$f":"IF(ISNA(VLOOKUP(X3,'Feiertage und Ferien'!$A:$D,3,FALSE)),IF(OR(WEEKDAY(X3)=1,WEEKDAY(X3)=7),\"\",Erfassung!$B$2*SUM(Erfassung!$G$2:$G$2)/5),\"F\")","v":6.7200000000000006},{"$f":"IF(ISNA(VLOOKUP(Y3,'Feiertage und Ferien'!$A:$D,3,FALSE)),IF(OR(WEEKDAY(Y3)=1,WEEKDAY(Y3)=7),\"\",Erfassung!$B$2*SUM(Erfassung!$G$2:$G$2)/5),\"F\")","v":6.7200000000000006},{"$f":"IF(ISNA(VLOOKUP(Z3,'Feiertage und Ferien'!$A:$D,3,FALSE)),IF(OR(WEEKDAY(Z3)=1,WEEKDAY(Z3)=7),\"\",Erfassung!$B$2*SUM(Erfassung!$G$2:$G$2)/5),\"F\")","v":""},{"$f":"IF(ISNA(VLOOKUP(AA3,'Feiertage und Ferien'!$A:$D,3,FALSE)),IF(OR(WEEKDAY(AA3)=1,WEEKDAY(AA3)=7),\"\",Erfassung!$B$2*SUM(Erfassung!$G$2:$G$2)/5),\"F\")","v":""},{"$f":"IF(ISNA(VLOOKUP(AB3,'Feiertage und Ferien'!$A:$D,3,FALSE)),IF(OR(WEEKDAY(AB3)=1,WEEKDAY(AB3)=7),\"\",Erfassung!$B$2*SUM(Erfassung!$G$2:$G$2)/5),\"F\")","v":6.7200000000000006},{"$f":"IF(ISNA(VLOOKUP(AC3,'Feiertage und Ferien'!$A:$D,3,FALSE)),IF(OR(WEEKDAY(AC3)=1,WEEKDAY(AC3)=7),\"\",Erfassung!$B$2*SUM(Erfassung!$G$2:$G$2)/5),\"F\")","v":6.7200000000000006},{"$f":"IF(ISNA(VLOOKUP(AD3,'Feiertage und Ferien'!$A:$D,3,FALSE)),IF(OR(WEEKDAY(AD3)=1,WEEKDAY(AD3)=7),\"\",Erfassung!$B$2*SUM(Erfassung!$G$2:$G$2)/5),\"F\")","v":6.7200000000000006},{"$f":"IF(ISNA(VLOOKUP(AE3,'Feiertage und Ferien'!$A:$D,3,FALSE)),IF(OR(WEEKDAY(AE3)=1,WEEKDAY(AE3)=7),\"\",Erfassung!$B$2*SUM(Erfassung!$G$2:$G$2)/5),\"F\")","v":6.7200000000000006},{"$f":"IF(ISNA(VLOOKUP(AF3,'Feiertage und Ferien'!$A:$D,3,FALSE)),IF(OR(WEEKDAY(AF3)=1,WEEKDAY(AF3)=7),\"\",Erfassung!$B$2*SUM(Erfassung!$G$2:$G$2)/5),\"F\")","v":6.7200000000000006},null,null,{"$f":"Erfassung!G2+20%","v":1},"Januar"]
[null,{"$f":"IF(B4=\"F\",B4,Arbeitstage!B5)","v":"F"},{"$f":"IF(C4=\"F\",C4,Arbeitstage!C5)","v":"F"},{"$f":"IF(D4=\"F\",D4,Arbeitstage!D5)","v":"F"},{"$f":"IF(E4=\"F\",E4,Arbeitstage!E5)","v":"F"},{"$f":"IF(F4=\"F\",F4,Arbeitstage!F5)","v":"F"},{"$f":"IF(G4=\"F\",G4,Arbeitstage!G5)","v":1},{"$f":"IF(H4=\"F\",H4,Arbeitstage!H5)","v":1},{"$f":"IF(I4=\"F\",I4,Arbeitstage!I5)","v":1},{"$f":"IF(J4=\"F\",J4,Arbeitstage!J5)","v":1},{"$f":"IF(K4=\"F\",K4,Arbeitstage!K5)","v":1},{"$f":"IF(L4=\"F\",L4,Arbeitstage!L5)","v":""},{"$f":"IF(M4=\"F\",M4,Arbeitstage!M5)","v":""},{"$f":"IF(N4=\"F\",N4,Arbeitstage!N5)","v":1},{"$f":"IF(O4=\"F\",O4,Arbeitstage!O5)","v":1},{"$f":"IF(P4=\"F\",P4,Arbeitstage!P5)","v":1},{"$f":"IF(Q4=\"F\",Q4,Arbeitstage!Q5)","v":1},{"$f":"IF(R4=\"F\",R4,Arbeitstage!R5)","v":1},{"$f":"IF(S4=\"F\",S4,Arbeitstage!S5)","v":""},{"$f":"IF(T4=\"F\",T4,Arbeitstage!T5)","v":""},{"$f":"IF(U4=\"F\",U4,Arbeitstage!U5)","v":1},{"$f":"IF(V4=\"F\",V4,Arbeitstage!V5)","v":1},{"$f":"IF(W4=\"F\",W4,Arbeitstage!W5)","v":1},{"$f":"IF(X4=\"F\",X4,Arbeitstage!X5)","v":1},{"$f":"IF(Y4=\"F\",Y4,Arbeitstage!Y5)","v":1},{"$f":"IF(Z4=\"F\",Z4,Arbeitstage!Z5)","v":"F"},{"$f":"IF(AA4=\"F\",AA4,Arbeitstage!AA5)","v":"F"},{"$f":"IF(AB4=\"F\",AB4,Arbeitstage!AB5)","v":"F"},{"$f":"IF(AC4=\"F\",AC4,Arbeitstage!AC5)","v":"F"},{"$f":"IF(AD4=\"F\",AD4,Arbeitstage!AD5)","v":"F"},{"$f":"IF(AE4=\"F\",AE4,Arbeitstage!AE5)","v":"F"},{"$f":"IF(AF4=\"F\",AF4,Arbeitstage!AF5)","v":"F"},{"$f":"SUM(Erfassung!$D:$D)/12","v":2.0833333333333335},{"$f":"IF(AG5=\"\",\"\",AG5*(Erfassung!B2/5)*SUM(Erfassung!G2:G2))","v":14.000000000000004},{"$f":"SUM(B5:AF5)","v":15},{"$f":"SUM(B4:AF4)","v":141.12},{"$f":"ROUND(AI5*AI4/5,1)*5","v":15}]
[null,{"$f":"AF3+1","v":"2025-02-01"},{"$f":"B6+1","v":"2025-02-02"},"2025-02-03","2025-02-04","2025-02-05","2025-02-06","2025-02-07","2025-02-08","2025-02-09","2025-02-10","2025-02-11","2025-02-12","2025-02-13","2025-02-14","2025-02-15","2025-02-16","2025-02-17","2025-02-18","2025-02-19","2025-02-20","2025-02-21","2025-02-22","2025-02-23","2025-02-24","2025-02-25","2025-02-26","2025-02-27","2025-02-28"]
{"$rows_left_out":39}
{"sheet":"Arbeitstage","index":3,"n_rows":33,"n_cols":36,"rows_kept":33,"cut":false,"hidden":true,"merged":[]}
["Arbeitszeiten"]
[]
[2025,1,2,3,4,5,6,7,8,9,10,11,12,13,14,15,16,17,18,19,20,21,22,23,24,25,26,27,28,29,30,31,1,"Mt.","%","Arbeitstage"]
[null,"2025-01-01",{"$f":"B4+1","v":"2025-01-02"},{"$f":"C4+1","v":"2025-01-03"},"2025-01-04","2025-01-05","2025-01-06","2025-01-07","2025-01-08","2025-01-09","2025-01-10","2025-01-11","2025-01-12","2025-01-13","2025-01-14","2025-01-15","2025-01-16","2025-01-17","2025-01-18","2025-01-19","2025-01-20","2025-01-21","2025-01-22","2025-01-23","2025-01-24","2025-01-25","2025-01-26","2025-01-27","2025-01-28","2025-01-29","2025-01-30","2025-01-31"]
["Januar",{"$f":"IF(SUMPRODUCT(('Feiertage und Ferien'!$H$8:$H$13<=B4)*('Feiertage und Ferien'!$I$8:$I$13>=B4)),\"F\",IF(OR(WEEKDAY(B4)=1,WEEKDAY(B4)=7),\"\",1))","v":"F"},{"$f":"IF(SUMPRODUCT(('Feiertage und Ferien'!$H$8:$H$13<=C4)*('Feiertage und Ferien'!$I$8:$I$13>=C4)),\"F\",IF(OR(WEEKDAY(C4)=1,WEEKDAY(C4)=7),\"\",1))","v":"F"},{"$f":"IF(SUMPRODUCT(('Feiertage und Ferien'!$H$8:$H$13<=D4)*('Feiertage und Ferien'!$I$8:$I$13>=D4)),\"F\",IF(OR(WEEKDAY(D4)=1,WEEKDAY(D4)=7),\"\",1))","v":"F"},{"$f":"IF(SUMPRODUCT(('Feiertage und Ferien'!$H$8:$H$13<=E4)*('Feiertage und Ferien'!$I$8:$I$13>=E4)),\"F\",IF(OR(WEEKDAY(E4)=1,WEEKDAY(E4)=7),\"\",1))","v":"F"},{"$f":"IF(SUMPRODUCT(('Feiertage und Ferien'!$H$8:$H$13<=F4)*('Feiertage und Ferien'!$I$8:$I$13>=F4)),\"F\",IF(OR(WEEKDAY(F4)=1,WEEKDAY(F4)=7),\"\",1))","v":"F"},{"$f":"IF(SUMPRODUCT(('Feiertage und Ferien'!$H$8:$H$13<=G4)*('Feiertage und Ferien'!$I$8:$I$13>=G4)),\"F\",IF(OR(WEEKDAY(G4)=1,WEEKDAY(G4)=7),\"\",1))","v":1},{"$f":"IF(SUMPRODUCT(('Feiertage und Ferien'!$H$8:$H$13<=H4)*('Feiertage und Ferien'!$I$8:$I$13>=H4)),\"F\",IF(OR(WEEKDAY(H4)=1,WEEKDAY(H4)=7),\"\",1))","v":1},{"$f":"IF(SUMPRODUCT(('Feiertage und Ferien'!$H$8:$H$13<=I4)*('Feiertage und Ferien'!$I$8:$I$13>=I4)),\"F\",IF(OR(WEEKDAY(I4)=1,WEEKDAY(I4)=7),\"\",1))","v":1},{"$f":"IF(SUMPRODUCT(('Feiertage und Ferien'!$H$8:$H$13<=J4)*('Feiertage und Ferien'!$I$8:$I$13>=J4)),\"F\",IF(OR(WEEKDAY(J4)=1,WEEKDAY(J4)=7),\"\",1))","v":1},{"$f":"IF(SUMPRODUCT(('Feiertage und Ferien'!$H$8:$H$13<=K4)*('Feiertage und Ferien'!$I$8:$I$13>=K4)),\"F\",IF(OR(WEEKDAY(K4)=1,WEEKDAY(K4)=7),\"\",1))","v":1},{"$f":"IF(SUMPRODUCT(('Feiertage und Ferien'!$H$8:$H$13<=L4)*('Feiertage und Ferien'!$I$8:$I$13>=L4)),\"F\",IF(OR(WEEKDAY(L4)=1,WEEKDAY(L4)=7),\"\",1))","v":""},{"$f":"IF(SUMPRODUCT(('Feiertage und Ferien'!$H$8:$H$13<=M4)*('Feiertage und Ferien'!$I$8:$I$13>=M4)),\"F\",IF(OR(WEEKDAY(M4)=1,WEEKDAY(M4)=7),\"\",1))","v":""},{"$f":"IF(SUMPRODUCT(('Feiertage und Ferien'!$H$8:$H$13<=N4)*('Feiertage und Ferien'!$I$8:$I$13>=N4)),\"F\",IF(OR(WEEKDAY(N4)=1,WEEKDAY(N4)=7),\"\",1))","v":1},{"$f":"IF(SUMPRODUCT(('Feiertage und Ferien'!$H$8:$H$13<=O4)*('Feiertage und Ferien'!$I$8:$I$13>=O4)),\"F\",IF(OR(WEEKDAY(O4)=1,WEEKDAY(O4)=7),\"\",1))","v":1},{"$f":"IF(SUMPRODUCT(('Feiertage und Ferien'!$H$8:$H$13<=P4)*('Feiertage und Ferien'!$I$8:$I$13>=P4)),\"F\",IF(OR(WEEKDAY(P4)=1,WEEKDAY(P4)=7),\"\",1))","v":1},{"$f":"IF(SUMPRODUCT(('Feiertage und Ferien'!$H$8:$H$13<=Q4)*('Feiertage und Ferien'!$I$8:$I$13>=Q4)),\"F\",IF(OR(WEEKDAY(Q4)=1,WEEKDAY(Q4)=7),\"\",1))","v":1},{"$f":"IF(SUMPRODUCT(('Feiertage und Ferien'!$H$8:$H$13<=R4)*('Feiertage und Ferien'!$I$8:$I$13>=R4)),\"F\",IF(OR(WEEKDAY(R4)=1,WEEKDAY(R4)=7),\"\",1))","v":1},{"$f":"IF(SUMPRODUCT(('Feiertage und Ferien'!$H$8:$H$13<=S4)*('Feiertage und Ferien'!$I$8:$I$13>=S4)),\"F\",IF(OR(WEEKDAY(S4)=1,WEEKDAY(S4)=7),\"\",1))","v":""},{"$f":"IF(SUMPRODUCT(('Feiertage und Ferien'!$H$8:$H$13<=T4)*('Feiertage und Ferien'!$I$8:$I$13>=T4)),\"F\",IF(OR(WEEKDAY(T4)=1,WEEKDAY(T4)=7),\"\",1))","v":""},{"$f":"IF(SUMPRODUCT(('Feiertage und Ferien'!$H$8:$H$13<=U4)*('Feiertage und Ferien'!$I$8:$I$13>=U4)),\"F\",IF(OR(WEEKDAY(U4)=1,WEEKDAY(U4)=7),\"\",1))","v":1},{"$f":"IF(SUMPRODUCT(('Feiertage und Ferien'!$H$8:$H$13<=V4)*('Feiertage und Ferien'!$I$8:$I$13>=V4)),\"F\",IF(OR(WEEKDAY(V4)=1,WEEKDAY(V4)=7),\"\",1))","v":1},{"$f":"IF(SUMPRODUCT(('Feiertage und Ferien'!$H$8:$H$13<=W4)*('Feiertage und Ferien'!$I$8:$I$13>=W4)),\"F\",IF(OR(WEEKDAY(W4)=1,WEEKDAY(W4)=7),\"\",1))","v":1},{"$f":"IF(SUMPRODUCT(('Feiertage und Ferien'!$H$8:$H$13<=X4)*('Feiertage und Ferien'!$I$8:$I$13>=X4)),\"F\",IF(OR(WEEKDAY(X4)=1,WEEKDAY(X4)=7),\"\",1))","v":1},{"$f":"IF(SUMPRODUCT(('Feiertage und Ferien'!$H$8:$H$13<=Y4)*('Feiertage und Ferien'!$I$8:$I$13>=Y4)),\"F\",IF(OR(WEEKDAY(Y4)=1,WEEKDAY(Y4)=7),\"\",1))","v":1},{"$f":"IF(SUMPRODUCT(('Feiertage und Ferien'!$H$8:$H$13<=Z4)*('Feiertage und Ferien'!$I$8:$I$13>=Z4)),\"F\",IF(OR(WEEKDAY(Z4)=1,WEEKDAY(Z4)=7),\"\",1))","v":"F"},{"$f":"IF(SUMPRODUCT(('Feiertage und Ferien'!$H$8:$H$13<=AA4)*('Feiertage und Ferien'!$I$8:$I$13>=AA4)),\"F\",IF(OR(WEEKDAY(AA4)=1,WEEKDAY(AA4)=7),\"\",1))","v":"F"},{"$f":"IF(SUMPRODUCT(('Feiertage und Ferien'!$H$8:$H$13<=AB4)*('Feiertage und Ferien'!$I$8:$I$13>=AB4)),\"F\",IF(OR(WEEKDAY(AB4)=1,WEEKDAY(AB4)=7),\"\",1))","v":"F"},{"$f":"IF(SUMPRODUCT(('Feiertage und Ferien'!$H$8:$H$13<=AC4)*('Feiertage und Ferien'!$I$8:$I$13>=AC4)),\"F\",IF(OR(WEEKDAY(AC4)=1,WEEKDAY(AC4)=7),\"\",1))","v":"F"},{"$f":"IF(SUMPRODUCT(('Feiertage und Ferien'!$H$8:$H$13<=AD4)*('Feiertage und Ferien'!$I$8:$I$13>=AD4)),\"F\",IF(OR(WEEKDAY(AD4)=1,WEEKDAY(AD4)=7),\"\",1))","v":"F"},{"$f":"IF(SUMPRODUCT(('Feiertage und Ferien'!$H$8:$H$13<=AE4)*('Feiertage und Ferien'!$I$8:$I$13>=AE4)),\"F\",IF(OR(WEEKDAY(AE4)=1,WEEKDAY(AE4)=7),\"\",1))","v":"F"},{"$f":"IF(SUMPRODUCT(('Feiertage und Ferien'!$H$8:$H$13<=AF4)*('Feiertage und Ferien'!$I$8:$I$13>=AF4)),\"F\",IF(OR(WEEKDAY(AF4)=1,WEEKDAY(AF4)=7),\"\",1))","v":"F"},{"$f":"COUNT(B5:AF5,\"<0.1\")","v":15},"Januar",{"$f":"Erfassung!G2+20%","v":1},{"$f":"ROUND(AG5*AI5/5,1)*5","v":15}]
[null,{"$f":"AF4+1","v":"2025-02-01"},{"$f":"B6+1","v":"2025-02-02"},"2025-02-03","2025-02-04","2025-02-05","2025-02-06","2025-02-07","2025-02-08","2025-02-09","2025-02-10","2025-02-11","2025-02-12","2025-02-13","2025-02-14","2025-02-15","2025-02-16","2025-02-17","2025-02-18","2025-02-19","2025-02-20","2025-02-21","2025-02-22","2025-02-23","2025-02-24","2025-02-25","2025-02-26","2025-02-27","2025-02-28"]
{"$rows_left_out":27}