{"text_format":"1","workbook":"xlsx","n_sheets":4,"sheets":["Erfassung","Feiertage und Ferien","Arbeitszeiten","Arbeitstage"],"not_rendered":{"charts":0,"images":0,"macros":0,"external_links":0,"defined_names":57,"comments":0,"pivot_tables":0},"unopened":[],"bounds":{"document_bytes":16777216,"sheet_cells":100000,"rows_first":2000,"rows_last":500,"rows_between":2000,"halvings":0,"cell_chars":16384,"cell_head_chars":4096},"cells_cut":0,"cells_raw":0,"read":"whole","date_system":"1900"}

{"sheet":"Erfassung","index":0,"n_rows":28,"n_cols":19,"rows_kept":28,"cut":false,"hidden":false,"merged":[[18,6,18,8],[5,6,6,17],[17,3,17,4],[14,3,16,4],[0,3,0,4],[1,3,1,4],[11,1,11,4],[12,1,13,4],[5,1,6,2],[12,6,13,17],[17,6,17,8]]}
["Jahr","Wochenarbeitszeit","Prozent alle Mt","Ferientage im Jahr",null,null,"Jan","Feb","März","Apr","Mai","Juni","Juli","Aug","Sept","Okt","Nov","Dez"]
[2025,42,0.8,25,null,null,{"$f":"$C$2","v":0.8},0.8,0.8,0.8,0.8,0.8,0.8,{"$f":"$C$2","v":0.8},0.8,0.8,0.8,0.8]
[null,"*die hellgrauen Werte können übertragen bzw. einzeln rausgelöschtwerden, die weiss hinterlegten Werte können angepasst werden."]
[]
[null,"Arbeitszeiten",null,null,null,null,"Arbeitstage"]
[null,"im ssa-app oder DossierManager unter Administration, Arbeitszeiten eintragen:",null,null,null,null,"im ssa-app oder DossierManager unter Administration, Arbeitstage eintragen:"]
[]
[null,"Jahresarbeitszeit","Ferien",null,null,null,"Jan","Feb","März","Apr","Mai","Juni","Juli","Aug","Sept","Okt","Nov","Dez",{"$f":"B9-C9","v":1525.44}]
[null,{"$f":"Arbeitszeiten!AK44","v":1693.44},{"$f":"Arbeitszeiten!AK43","v":168},null,null,null,{"$f":"IF(G2=\"\",0,Arbeitszeiten!AK5)","v":15},{"$f":"IF(H2=\"\",0,Arbeitszeiten!AK8)","v":15},{"$f":"IF(I2=\"\",0,Arbeitszeiten!AK11)","v":21},{"$f":"IF(J2=\"\",0,Arbeitszeiten!AK14)","v":20},{"$f":"IF(K2=\"\",0,Arbeitszeiten!AK17)","v":11},{"$f":"IF(L2=\"\",0,Arbeitszeiten!AK20)","v":20},{"$f":"IF(M2=\"\",0,Arbeitszeiten!AK23)","v":4},{"$f":"IF(N2=\"\",0,Arbeitszeiten!AK26)","v":15},{"$f":"IF(O2=\"\",0,Arbeitszeiten!AK29)","v":20},{"$f":"IF(P2=\"\",0,Arbeitszeiten!AK32)","v":15},{"$f":"IF(Q2=\"\",0,Arbeitszeiten!AK35)","v":20},{"$f":"IF(R2=\"\",0,Arbeitszeiten!AK38)","v":15},{"$f":"SUM(G9:R9)","v":191}]
[]
[]
[null,"Sollzeiten Schulhäuser",null,null,null,null,"Monatliche Arbeitszeit"]
[null,"im ssa-app uner Schulhäuser/Gemeinden oder im DossierManager unter Räume/Orte eintragen:",null,null,null,null,"im ssa-app oder DossierManager unter Administration, Monatliche Arbeitstage eintragen:"]
[]
[null,"Jahres AZ-Ferien:",{"$f":"B9-C9","v":1525.44},"Saldovotrag Vorjahr nur eintragen, falls man dies den Schulh. prozentual abziehen möchte",null,null,"Jan","Feb","März","Apr","Mai","Juni","Juli","Aug","Sept","Okt","Nov","Dez"]
[null,"Saldovotrag Vorjahr:",null,null,null,null,{"$f":"$S$8/$S$9*G9","v":119.79895287958115},119.79895287958115,167.71853403141361,159.73193717277488,87.852565445026187,159.73193717277488,31.946387434554975,119.79895287958115,159.73193717277488,119.79895287958115,159.73193717277488,119.79895287958115]
[null,"Total Stunden:",{"$f":"C15-C16","v":1525.44},null,null,null,null,null,null,null,null,null,null,null,null,null,"TOTAL",{"$f":"SUM(G16:R16)","v":1525.4399999999998}]
[null,"Name Schulhaus","Stellenprozente","Total Stunden",null,null,"Komp. Tagessoll"]
[null,"Schulhaus 1",0.2,null,{"$f":"$C$17/$C$2*C19","v":381.36},null,{"$f":"(B9-C9)/(SUM(G9:R9))","v":7.9865968586387437}]
[null,"Schulhaus 2",0.3,null,572.04]
[null,"Schulhaus 3",0.2,null,381.36]
[null,"Schulhaus 4",0.1,null,190.68]
[null,null,null,null,0]
[null,null,null,null,0]
[null,null,null,null,0]
[null,null,null,null,0]
[null,null,null,null,0]
[null,null,"Total:",null,{"$f":"SUM(E19:E27)","v":1525.44},null,{"$f":"IF(E28=C17,\"\",\"Die Stunden Schulhäuser oder die Prozente stimmen nicht überein\")","v":""}]

{"sheet":"Feiertage und Ferien","index":1,"n_rows":17,"n_cols":9,"rows_kept":17,"cut":false,"hidden":false,"merged":[[1,5,2,8]]}
["Datum","Feiertag"]
["2025-01-01","Neujahrstag",null,null,null,"zu den Resultaten"]
["2025-01-02","Berchtoldstag (statt 1. Mai = gleiches Resultat)"]
["2025-04-18","Karfreitag"]
["2025-04-21","Ostermontag"]
["2025-05-29","Auffahrt",null,null,null,"Ferienplan (nur für Berechnung Arbeitstage relevant):"]
["2025-06-09","Pfingstmontag",null,null,null,null,null,"Start","Ende"]
["2025-08-01","Nationalfeiertag Schweiz",null,null,null,"Weihnachtsferien",null,"2025-01-01","2025-01-05"]
["2025-12-25","Weihnachten",null,null,null,"Winterferien",null,"2025-01-25",{"$f":"H9+14","v":"2025-02-08"}]
["2025-12-26","Stephanstag",null,null,null,"Frühlingsferien",null,"2025-05-03",{"$f":"H10+14","v":"2025-05-17"}]
[null,null,null,null,null,"Sommerferien",null,"2025-07-05",{"$f":"H11+35","v":"2025-08-09"}]
[null,null,null,null,null,"Herbstferien",null,"2025-09-27",{"$f":"H12+14","v":"2025-10-11"}]
[null,null,null,null,null,"Weihnachtsferien",null,"2025-12-20",{"$f":"H13+14","v":"2026-01-03"}]
[]
[null,null,null,null,null,"Feiertage in der Schweiz"]
[]
[null,null,null,null,null,"Anleitung zur Berechung eines halber Feiertages oder zusätzlichen Ferien"]

{"sheet":"Arbeitszeiten","index":2,"n_rows":44,"n_cols":37,"rows_kept":44,"cut":false,"hidden":false,"merged":[[1,35,1,36],[36,0,37,0],[9,0,10,0],[6,0,7,0],[12,0,13,0],[15,0,16,0],[33,0,34,0],[18,0,19,0],[21,0,22,0],[24,0,25,0],[27,0,28,0],[30,0,31,0],[3,0,4,0]]}
["Arbeitszeiten"]
[2025,1,2,3,4,5,6,7,8,9,10,11,12,13,14,15,16,17,18,19,20,21,22,23,24,25,26,27,28,29,30,31,"F Tage","Ferien h","A-Tage","Monatssaldo"]
[null,"2025-01-01",{"$f":"B3+1","v":"2025-01-02"},{"$f":"C3+1","v":"2025-01-03"},"2025-01-04","2025-01-05","2025-01-06","2025-01-07","2025-01-08","2025-01-09","2025-01-10","2025-01-11","2025-01-12","2025-01-13","2025-01-14","2025-01-15","2025-01-16","2025-01-17","2025-01-18","2025-01-19","2025-01-20","2025-01-21","2025-01-22","2025-01-23","2025-01-24","2025-01-25","2025-01-26","2025-01-27","2025-01-28","2025-01-29","2025-01-30","2025-01-31"]
["Januar",{"$f":"IF(ISNA(VLOOKUP(B3,'Feiertage und Ferien'!$A:$D,3,FALSE)),IF(OR(WEEKDAY(B3)=1,WEEKDAY(B3)=7),\"\",Erfassung!$B$2*SUM(Erfassung!$G$2:$G$2)/5),\"F\")","v":"F"},{"$f":"IF(ISNA(VLOOKUP(C3,'Feiertage und Ferien'!$A:$D,3,FALSE)),IF(OR(WEEKDAY(C3)=1,WEEKDAY(C3)=7),\"\",Erfassung!$B$2*SUM(Erfassung!$G$2:$G$2)/5),\"F\")","v":"F"},{"$f":"IF(ISNA(VLOOKUP(D3,'Feiertage und Ferien'!$A:$D,3,FALSE)),IF(OR(WEEKDAY(D3)=1,WEEKDAY(D3)=7),\"\",Erfassung!$B$2*SUM(Erfassung!$G$2:$G$2)/5),\"F\")","v":6.7200000000000006},{"$f":"IF(ISNA(VLOOKUP(E3,'Feiertage und Ferien'!$A:$D,3,FALSE)),IF(OR(WEEKDAY(E3)=1,WEEKDAY(E3)=7),\"\",Erfassung!$B$2*SUM(Erfassung!$G$2:$G$2)/5),\"F\")","v":""},{"$f":"IF(ISNA(VLOOKUP(F3,'Feiertage und Ferien'!$A:$D,3,FALSE)),IF(OR(WEEKDAY(F3)=1,WEEKDAY(F3)=7),\"\",Erfassung!$B$2*SUM(Erfassung!$G$2:$G$2)/5),\"F\")","v":""},{"$f":"IF(ISNA(VLOOKUP(G3,'Feiertage und Ferien'!$A:$D,3,FALSE)),IF(OR(WEEKDAY(G3)=1,WEEKDAY(G3)=7),\"\",Erfassung!$B$2*SUM(Erfassung!$G$2:$G$2)/5),\"F\")","v":6.7200000000000006},{"$f":"IF(ISNA(VLOOKUP(H3,'Feiertage und Ferien'!$A:$D,3,FALSE)),IF(OR(WEEKDAY(H3)=1,WEEKDAY(H3)=7),\"\",Erfassung!$B$2*SUM(Erfassung!$G$2:$G$2)/5),\"F\")","v":6.7200000000000006},{"$f":"IF(ISNA(VLOOKUP(I3,'Feiertage und Ferien'!$A:$D,3,FALSE)),IF(OR(WEEKDAY(I3)=1,WEEKDAY(I3)=7),\"\",Erfassung!$B$2*SUM(Erfassung!$G$2:$G$2)/5),\"F\")","v":6.7200000000000006},{"$f":"IF(ISNA(VLOOKUP(J3,'Feiertage und Ferien'!$A:$D,3,FALSE)),IF(OR(WEEKDAY(J3)=1,WEEKDAY(J3)=7),\"\",Erfassung!$B$2*SUM(Erfassung!$G$2:$G$2)/5),\"F\")","v":6.7200000000000006},{"$f":"IF(ISNA(VLOOKUP(K3,'Feiertage und Ferien'!$A:$D,3,FALSE)),IF(OR(WEEKDAY(K3)=1,WEEKDAY(K3)=7),\"\",Erfassung!$B$2*SUM(Erfassung!$G$2:$G$2)/5),\"F\")","v":6.7200000000000006},{"$f":"IF(ISNA(VLOOKUP(L3,'Feiertage und Ferien'!$A:$D,3,FALSE)),IF(OR(WEEKDAY(L3)=1,WEEKDAY(L3)=7),\"\",Erfassung!$B$2*SUM(Erfassung!$G$2:$G$2)/5),\"F\")","v":""},{"$f":"IF(ISNA(VLOOKUP(M3,'Feiertage und Ferien'!$A:$D,3,FALSE)),IF(OR(WEEKDAY(M3)=1,WEEKDAY(M3)=7),\"\",Erfassung!$B$2*SUM(Erfassung!$G$2:$G$2)/5),\"F\")","v":""},{"$f":"IF(ISNA(VLOOKUP(N3,'Feiertage und Ferien'!$A:$D,3,FALSE)),IF(OR(WEEKDAY(N3)=1,WEEKDAY(N3)=7),\"\",Erfassung!$B$2*SUM(Erfassung!$G$2:$G$2)/5),\"F\")","v":6.7200000000000006},{"$f":"IF(ISNA(VLOOKUP(O3,'Feiertage und Ferien'!$A:$D,3,FALSE)),IF(OR(WEEKDAY(O3)=1,WEEKDAY(O3)=7),\"\",Erfassung!$B$2*SUM(Erfassung!$G$2:$G$2)/5),\"F\")","v":6.7200000000000006},{"$f":"IF(ISNA(VLOOKUP(P3,'Feiertage und Ferien'!$A:$D,3,FALSE)),IF(OR(WEEKDAY(P3)=1,WEEKDAY(P3)=7),\"\",Erfassung!$B$2*SUM(Erfassung!$G$2:$G$2)/5),\"F\")","v":6.7200000000000006},{"$f":"IF(ISNA(VLOOKUP(Q3,'Feiertage und Ferien'!$A:$D,3,FALSE)),IF(OR(WEEKDAY(Q3)=1,WEEKDAY(Q3)=7),\"\",Erfassung!$B$2*SUM(Erfassung!$G$2:$G$2)/5),\"F\")","v":6.7200000000000006},{"$f":"IF(ISNA(VLOOKUP(R3,'Feiertage und Ferien'!$A:$D,3,FALSE)),IF(OR(WEEKDAY(R3)=1,WEEKDAY(R3)=7),\"\",Erfassung!$B$2*SUM(Erfassung!$G$2:$G$2)/5),\"F\")","v":6.7200000000000006},{"$f":"IF(ISNA(VLOOKUP(S3,'Feiertage und Ferien'!$A:$D,3,FALSE)),IF(OR(WEEKDAY(S3)=1,WEEKDAY(S3)=7),\"\",Erfassung!$B$2*SUM(Erfassung!$G$2:$G$2)/5),\"F\")","v":""},{"$f":"IF(ISNA(VLOOKUP(T3,'Feiertage und Ferien'!$A:$D,3,FALSE)),IF(OR(WEEKDAY(T3)=1,WEEKDAY(T3)=7),\"\",Erfassung!$B$2*SUM(Erfassung!$G$2:$G$2)/5),\"F\")","v":""},{"$f":"IF(ISNA(VLOOKUP(U3,'Feiertage und Ferien'!$A:$D,3,FALSE)),IF(OR(WEEKDAY(U3)=1,WEEKDAY(U3)=7),\"\",Erfassung!$B$2*SUM(Erfassung!$G$2:$G$2)/5),\"F\")","v":6.7200000000000006},{"$f":"IF(ISNA(VLOOKUP(V3,'Feiertage und Ferien'!$A:$D,3,FALSE)),IF(OR(WEEKDAY(V3)=1,WEEKDAY(V3)=7),\"\",Erfassung!$B$2*SUM(Erfassung!$G$2:$G$2)/5),\"F\")","v":6.7200000000000006},{"$f":"IF(ISNA(VLOOKUP(W3,'Feiertage und Ferien'!$A:$D,3,FALSE)),IF(OR(WEEKDAY(W3)=1,WEEKDAY(W3)=7),\"\",Erfassung!$B$2*SUM(Erfassung!$G$2:$G$2)/5),\"F\")","v":6.7200000000000006},{"$f":"IF(ISNA(VLOOKUP(X3,'Feiertage und Ferien'!$A:$D,3,FALSE)),IF(OR(WEEKDAY(X3)=1,WEEKDAY(X3)=7),\"\",Erfassung!$B$2*SUM(Erfassung!$G$2:$G$2)/5),\"F\")","v":6.7200000000000006},{"$f":"IF(ISNA(VLOOKUP(Y3,'Feiertage und Ferien'!$A:$D,3,FALSE)),IF(OR(WEEKDAY(Y3)=1,WEEKDAY(Y3)=7),\"\",Erfassung!$B$2*SUM(Erfassung!$G$2:$G$2)/5),\"F\")","v":6.7200000000000006},{"$f":"IF(ISNA(VLOOKUP(Z3,'Feiertage und Ferien'!$A:$D,3,FALSE)),IF(OR(WEEKDAY(Z3)=1,WEEKDAY(Z3)=7),\"\",Erfassung!$B$2*SUM(Erfassung!$G$2:$G$2)/5),\"F\")","v":""},{"$f":"IF(ISNA(VLOOKUP(AA3,'Feiertage und Ferien'!$A:$D,3,FALSE)),IF(OR(WEEKDAY(AA3)=1,WEEKDAY(AA3)=7),\"\",Erfassung!$B$2*SUM(Erfassung!$G$2:$G$2)/5),\"F\")","v":""},{"$f":"IF(ISNA(VLOOKUP(AB3,'Feiertage und Ferien'!$A:$D,3,FALSE)),IF(OR(WEEKDAY(AB3)=1,WEEKDAY(AB3)=7),\"\",Erfassung!$B$2*SUM(Erfassung!$G$2:$G$2)/5),\"F\")","v":6.7200000000000006},{"$f":"IF(ISNA(VLOOKUP(AC3,'Feiertage und Ferien'!$A:$D,3,FALSE)),IF(OR(WEEKDAY(AC3)=1,WEEKDAY(AC3)=7),\"\",Erfassung!$B$2*SUM(Erfassung!$G$2:$G$2)/5),\"F\")","v":6.7200000000000006},{"$f":"IF(ISNA(VLOOKUP(AD3,'Feiertage und Ferien'!$A:$D,3,FALSE)),IF(OR(WEEKDAY(AD3)=1,WEEKDAY(AD3)=7),\"\",Erfassung!$B$2*SUM(Erfassung!$G$2:$G$2)/5),\"F\")","v":6.7200000000000006},{"$f":"IF(ISNA(VLOOKUP(AE3,'Feiertage und Ferien'!$A:$D,3,FALSE)),IF(OR(WEEKDAY(AE3)=1,WEEKDAY(AE3)=7),\"\",Erfassung!$B$2*SUM(Erfassung!$G$2:$G$2)/5),\"F\")","v":6.7200000000000006},{"$f":"IF(ISNA(VLOOKUP(AF3,'Feiertage und Ferien'!$A:$D,3,FALSE)),IF(OR(WEEKDAY(AF3)=1,WEEKDAY(AF3)=7),\"\",Erfassung!$B$2*SUM(Erfassung!$G$2:$G$2)/5),\"F\")","v":6.7200000000000006},null,null,{"$f":"Erfassung!G2+20%","v":1},"Januar"]
[null,{"$f":"IF(B4=\"F\",B4,Arbeitstage!B5)","v":"F"},{"$f":"IF(C4=\"F\",C4,Arbeitstage!C5)","v":"F"},{"$f":"IF(D4=\"F\",D4,Arbeitstage!D5)","v":"F"},{"$f":"IF(E4=\"F\",E4,Arbeitstage!E5)","v":"F"},{"$f":"IF(F4=\"F\",F4,Arbeitstage!F5)","v":"F"},{"$f":"IF(G4=\"F\",G4,Arbeitstage!G5)","v":1},{"$f":"IF(H4=\"F\",H4,Arbeitstage!H5)","v":1},{"$f":"IF(I4=\"F\",I4,Arbeitstage!I5)","v":1},{"$f":"IF(J4=\"F\",J4,Arbeitstage!J5)","v":1},{"$f":"IF(K4=\"F\",K4,Arbeitstage!K5)","v":1},{"$f":"IF(L4=\"F\",L4,Arbeitstage!L5)","v":""},{"$f":"IF(M4=\"F\",M4,Arbeitstage!M5)","v":""},{"$f":"IF(N4=\"F\",N4,Arbeitstage!N5)","v":1},{"$f":"IF(O4=\"F\",O4,Arbeitstage!O5)","v":1},{"$f":"IF(P4=\"F\",P4,Arbeitstage!P5)","v":1},{"$f":"IF(Q4=\"F\",Q4,Arbeitstage!Q5)","v":1},{"$f":"IF(R4=\"F\",R4,Arbeitstage!R5)","v":1},{"$f":"IF(S4=\"F\",S4,Arbeitstage!S5)","v":""},{"$f":"IF(T4=\"F\",T4,Arbeitstage!T5)","v":""},{"$f":"IF(U4=\"F\",U4,Arbeitstage!U5)","v":1},{"$f":"IF(V4=\"F\",V4,Arbeitstage!V5)","v":1},{"$f":"IF(W4=\"F\",W4,Arbeitstage!W5)","v":1},{"$f":"IF(X4=\"F\",X4,Arbeitstage!X5)","v":1},{"$f":"IF(Y4=\"F\",Y4,Arbeitstage!Y5)","v":1},{"$f":"IF(Z4=\"F\",Z4,Arbeitstage!Z5)","v":"F"},{"$f":"IF(AA4=\"F\",AA4,Arbeitstage!AA5)","v":"F"},{"$f":"IF(AB4=\"F\",AB4,Arbeitstage!AB5)","v":"F"},{"$f":"IF(AC4=\"F\",AC4,Arbeitstage!AC5)","v":"F"},{"$f":"IF(AD4=\"F\",AD4,Arbeitstage!AD5)","v":"F"},{"$f":"IF(AE4=\"F\",AE4,Arbeitstage!AE5)","v":"F"},{"$f":"IF(AF4=\"F\",AF4,Arbeitstage!AF5)","v":"F"},{"$f":"SUM(Erfassung!$D:$D)/12","v":2.0833333333333335},{"$f":"IF(AG5=\"\",\"\",AG5*(Erfassung!B2/5)*SUM(Erfassung!G2:G2))","v":14.000000000000004},{"$f":"SUM(B5:AF5)","v":15},{"$f":"SUM(B4:AF4)","v":141.12},{"$f":"ROUND(AI5*AI4/5,1)*5","v":15}]
[null,{"$f":"AF3+1","v":"2025-02-01"},{"$f":"B6+1","v":"2025-02-02"},"2025-02-03","2025-02-04","2025-02-05","2025-02-06","2025-02-07","2025-02-08","2025-02-09","2025-02-10","2025-02-11","2025-02-12","2025-02-13","2025-02-14","2025-02-15","2025-02-16","2025-02-17","2025-02-18","2025-02-19","2025-02-20","2025-02-21","2025-02-22","2025-02-23","2025-02-24","2025-02-25","2025-02-26","2025-02-27","2025-02-28"]
["Februar",{"$f":"IF(ISNA(VLOOKUP(B6,'Feiertage und Ferien'!$A:$D,3,FALSE)),IF(OR(WEEKDAY(B6)=1,WEEKDAY(B6)=7),\"\",Erfassung!$B$2*SUM(Erfassung!$H2:$H2)/5),\"F\")","v":""},{"$f":"IF(ISNA(VLOOKUP(C6,'Feiertage und Ferien'!$A:$D,3,FALSE)),IF(OR(WEEKDAY(C6)=1,WEEKDAY(C6)=7),\"\",Erfassung!$B$2*SUM(Erfassung!$H2:$H2)/5),\"F\")","v":""},{"$f":"IF(ISNA(VLOOKUP(D6,'Feiertage und Ferien'!$A:$D,3,FALSE)),IF(OR(WEEKDAY(D6)=1,WEEKDAY(D6)=7),\"\",Erfassung!$B$2*SUM(Erfassung!$H2:$H2)/5),\"F\")","v":6.7200000000000006},{"$f":"IF(ISNA(VLOOKUP(E6,'Feiertage und Ferien'!$A:$D,3,FALSE)),IF(OR(WEEKDAY(E6)=1,WEEKDAY(E6)=7),\"\",Erfassung!$B$2*SUM(Erfassung!$H2:$H2)/5),\"F\")","v":6.7200000000000006},{"$f":"IF(ISNA(VLOOKUP(F6,'Feiertage und Ferien'!$A:$D,3,FALSE)),IF(OR(WEEKDAY(F6)=1,WEEKDAY(F6)=7),\"\",Erfassung!$B$2*SUM(Erfassung!$H2:$H2)/5),\"F\")","v":6.7200000000000006},{"$f":"IF(ISNA(VLOOKUP(G6,'Feiertage und Ferien'!$A:$D,3,FALSE)),IF(OR(WEEKDAY(G6)=1,WEEKDAY(G6)=7),\"\",Erfassung!$B$2*SUM(Erfassung!$H2:$H2)/5),\"F\")","v":6.7200000000000006},{"$f":"IF(ISNA(VLOOKUP(H6,'Feiertage und Ferien'!$A:$D,3,FALSE)),IF(OR(WEEKDAY(H6)=1,WEEKDAY(H6)=7),\"\",Erfassung!$B$2*SUM(Erfassung!$H2:$H2)/5),\"F\")","v":6.7200000000000006},{"$f":"IF(ISNA(VLOOKUP(I6,'Feiertage und Ferien'!$A:$D,3,FALSE)),IF(OR(WEEKDAY(I6)=1,WEEKDAY(I6)=7),\"\",Erfassung!$B$2*SUM(Erfassung!$H2:$H2)/5),\"F\")","v":""},{"$f":"IF(ISNA(VLOOKUP(J6,'Feiertage und Ferien'!$A:$D,3,FALSE)),IF(OR(WEEKDAY(J6)=1,WEEKDAY(J6)=7),\"\",Erfassung!$B$2*SUM(Erfassung!$H2:$H2)/5),\"F\")","v":""},{"$f":"IF(ISNA(VLOOKUP(K6,'Feiertage und Ferien'!$A:$D,3,FALSE)),IF(OR(WEEKDAY(K6)=1,WEEKDAY(K6)=7),\"\",Erfassung!$B$2*SUM(Erfassung!$H2:$H2)/5),\"F\")","v":6.7200000000000006},{"$f":"IF(ISNA(VLOOKUP(L6,'Feiertage und Ferien'!$A:$D,3,FALSE)),IF(OR(WEEKDAY(L6)=1,WEEKDAY(L6)=7),\"\",Erfassung!$B$2*SUM(Erfassung!$H2:$H2)/5),\"F\")","v":6.7200000000000006},{"$f":"IF(ISNA(VLOOKUP(M6,'Feiertage und Ferien'!$A:$D,3,FALSE)),IF(OR(WEEKDAY(M6)=1,WEEKDAY(M6)=7),\"\",Erfassung!$B$2*SUM(Erfassung!$H2:$H2)/5),\"F\")","v":6.7200000000000006},{"$f":"IF(ISNA(VLOOKUP(N6,'Feiertage und Ferien'!$A:$D,3,FALSE)),IF(OR(WEEKDAY(N6)=1,WEEKDAY(N6)=7),\"\",Erfassung!$B$2*SUM(Erfassung!$H2:$H2)/5),\"F\")","v":6.7200000000000006},{"$f":"IF(ISNA(VLOOKUP(O6,'Feiertage und Ferien'!$A:$D,3,FALSE)),IF(OR(WEEKDAY(O6)=1,WEEKDAY(O6)=7),\"\",Erfassung!$B$2*SUM(Erfassung!$H2:$H2)/5),\"F\")","v":6.7200000000000006},{"$f":"IF(ISNA(VLOOKUP(P6,'Feiertage und Ferien'!$A:$D,3,FALSE)),IF(OR(WEEKDAY(P6)=1,WEEKDAY(P6)=7),\"\",Erfassung!$B$2*SUM(Erfassung!$H2:$H2)/5),\"F\")","v":""},{"$f":"IF(ISNA(VLOOKUP(Q6,'Feiertage und Ferien'!$A:$D,3,FALSE)),IF(OR(WEEKDAY(Q6)=1,WEEKDAY(Q6)=7),\"\",Erfassung!$B$2*SUM(Erfassung!$H2:$H2)/5),\"F\")","v":""},{"$f":"IF(ISNA(VLOOKUP(R6,'Feiertage und Ferien'!$A:$D,3,FALSE)),IF(OR(WEEKDAY(R6)=1,WEEKDAY(R6)=7),\"\",Erfassung!$B$2*SUM(Erfassung!$H2:$H2)/5),\"F\")","v":6.7200000000000006},{"$f":"IF(ISNA(VLOOKUP(S6,'Feiertage und Ferien'!$A:$D,3,FALSE)),IF(OR(WEEKDAY(S6)=1,WEEKDAY(S6)=7),\"\",Erfassung!$B$2*SUM(Erfassung!$H2:$H2)/5),\"F\")","v":6.7200000000000006},{"$f":"IF(ISNA(VLOOKUP(T6,'Feiertage und Ferien'!$A:$D,3,FALSE)),IF(OR(WEEKDAY(T6)=1,WEEKDAY(T6)=7),\"\",Erfassung!$B$2*SUM(Erfassung!$H2:$H2)/5),\"F\")","v":6.7200000000000006},{"$f":"IF(ISNA(VLOOKUP(U6,'Feiertage und Ferien'!$A:$D,3,FALSE)),IF(OR(WEEKDAY(U6)=1,WEEKDAY(U6)=7),\"\",Erfassung!$B$2*SUM(Erfassung!$H2:$H2)/5),\"F\")","v":6.7200000000000006},{"$f":"IF(ISNA(VLOOKUP(V6,'Feiertage und Ferien'!$A:$D,3,FALSE)),IF(OR(WEEKDAY(V6)=1,WEEKDAY(V6)=7),\"\",Erfassung!$B$2*SUM(Erfassung!$H2:$H2)/5),\"F\")","v":6.7200000000000006},{"$f":"IF(ISNA(VLOOKUP(W6,'Feiertage und Ferien'!$A:$D,3,FALSE)),IF(OR(WEEKDAY(W6)=1,WEEKDAY(W6)=7),\"\",Erfassung!$B$2*SUM(Erfassung!$H2:$H2)/5),\"F\")","v":""},{"$f":"IF(ISNA(VLOOKUP(X6,'Feiertage und Ferien'!$A:$D,3,FALSE)),IF(OR(WEEKDAY(X6)=1,WEEKDAY(X6)=7),\"\",Erfassung!$B$2*SUM(Erfassung!$H2:$H2)/5),\"F\")","v":""},{"$f":"IF(ISNA(VLOOKUP(Y6,'Feiertage und Ferien'!$A:$D,3,FALSE)),IF(OR(WEEKDAY(Y6)=1,WEEKDAY(Y6)=7),\"\",Erfassung!$B$2*SUM(Erfassung!$H2:$H2)/5),\"F\")","v":6.7200000000000006},{"$f":"IF(ISNA(VLOOKUP(Z6,'Feiertage und Ferien'!$A:$D,3,FALSE)),IF(OR(WEEKDAY(Z6)=1,WEEKDAY(Z6)=7),\"\",Erfassung!$B$2*SUM(Erfassung!$H2:$H2)/5),\"F\")","v":6.7200000000000006},{"$f":"IF(ISNA(VLOOKUP(AA6,'Feiertage und Ferien'!$A:$D,3,FALSE)),IF(OR(WEEKDAY(AA6)=1,WEEKDAY(AA6)=7),\"\",Erfassung!$B$2*SUM(Erfassung!$H2:$H2)/5),\"F\")","v":6.7200000000000006},{"$f":"IF(ISNA(VLOOKUP(AB6,'Feiertage und Ferien'!$A:$D,3,FALSE)),IF(OR(WEEKDAY(AB6)=1,WEEKDAY(AB6)=7),\"\",Erfassung!$B$2*SUM(Erfassung!$H2:$H2)/5),\"F\")","v":6.7200000000000006},{"$f":"IF(ISNA(VLOOKUP(AC6,'Feiertage und Ferien'!$A:$D,3,FALSE)),IF(OR(WEEKDAY(AC6)=1,WEEKDAY(AC6)=7),\"\",Erfassung!$B$2*SUM(Erfassung!$H2:$H2)/5),\"F\")","v":6.7200000000000006},{"$f":"IF(ISNA(VLOOKUP(AD6,'Feiertage und Ferien'!$A:$D,3,FALSE)),IF(OR(WEEKDAY(AD6)=1,WEEKDAY(AD6)=7),\"\",Erfassung!$B$2*SUM(Erfassung!$H2:$H2)/5),\"F\")","v":""},{"$f":"IF(ISNA(VLOOKUP(AE6,'Feiertage und Ferien'!$A:$D,3,FALSE)),IF(OR(WEEKDAY(AE6)=1,WEEKDAY(AE6)=7),\"\",Erfassung!$B$2*SUM(Erfassung!$H2:$H2)/5),\"F\")","v":""},{"$f":"IF(ISNA(VLOOKUP(AF6,'Feiertage und Ferien'!$A:$D,3,FALSE)),IF(OR(WEEKDAY(AF6)=1,WEEKDAY(AF6)=7),\"\",Erfassung!$B$2*SUM(Erfassung!$H2:$H2)/5),\"F\")","v":""},null,null,{"$f":"Erfassung!H2+20%","v":1},"Februar"]
[null,{"$f":"IF(B7=\"F\",B7,Arbeitstage!B7)","v":"F"},{"$f":"IF(C7=\"F\",C7,Arbeitstage!C7)","v":"F"},{"$f":"IF(D7=\"F\",D7,Arbeitstage!D7)","v":"F"},{"$f":"IF(E7=\"F\",E7,Arbeitstage!E7)","v":"F"},{"$f":"IF(F7=\"F\",F7,Arbeitstage!F7)","v":"F"},{"$f":"IF(G7=\"F\",G7,Arbeitstage!G7)","v":"F"},{"$f":"IF(H7=\"F\",H7,Arbeitstage!H7)","v":"F"},{"$f":"IF(I7=\"F\",I7,Arbeitstage!I7)","v":"F"},{"$f":"IF(J7=\"F\",J7,Arbeitstage!J7)","v":""},{"$f":"IF(K7=\"F\",K7,Arbeitstage!K7)","v":1},{"$f":"IF(L7=\"F\",L7,Arbeitstage!L7)","v":1},{"$f":"IF(M7=\"F\",M7,Arbeitstage!M7)","v":1},{"$f":"IF(N7=\"F\",N7,Arbeitstage!N7)","v":1},{"$f":"IF(O7=\"F\",O7,Arbeitstage!O7)","v":1},{"$f":"IF(P7=\"F\",P7,Arbeitstage!P7)","v":""},{"$f":"IF(Q7=\"F\",Q7,Arbeitstage!Q7)","v":""},{"$f":"IF(R7=\"F\",R7,Arbeitstage!R7)","v":1},{"$f":"IF(S7=\"F\",S7,Arbeitstage!S7)","v":1},{"$f":"IF(T7=\"F\",T7,Arbeitstage!T7)","v":1},{"$f":"IF(U7=\"F\",U7,Arbeitstage!U7)","v":1},{"$f":"IF(V7=\"F\",V7,Arbeitstage!V7)","v":1},{"$f":"IF(W7=\"F\",W7,Arbeitstage!W7)","v":""},{"$f":"IF(X7=\"F\",X7,Arbeitstage!X7)","v":""},{"$f":"IF(Y7=\"F\",Y7,Arbeitstage!Y7)","v":1},{"$f":"IF(Z7=\"F\",Z7,Arbeitstage!Z7)","v":1},{"$f":"IF(AA7=\"F\",AA7,Arbeitstage!AA7)","v":1},{"$f":"IF(AB7=\"F\",AB7,Arbeitstage!AB7)","v":1},{"$f":"IF(AC7=\"F\",AC7,Arbeitstage!AC7)","v":1},{"$f":"IF(AD7=\"F\",AD7,Arbeitstage!AD7)","v":""},{"$f":"IF(AE7=\"F\",AE7,Arbeitstage!AE7)","v":""},{"$f":"IF(AF7=\"F\",AF7,Arbeitstage!AF7)","v":""},{"$f":"SUM(Erfassung!$D:$D)/12","v":2.0833333333333335},{"$f":"IF(AG8=\"\",\"\",AG8*Erfassung!B2*SUM(Erfassung!H2:H2)/5)","v":14},{"$f":"SUM(B8:AF8)","v":15},{"$f":"SUM(B7:AF7)","v":134.4},{"$f":"ROUND(AI8*AI7/5,1)*5","v":15}]
[null,{"$f":"AC6+1","v":"2025-03-01"},{"$f":"B9+1","v":45718},45719,45720,45721,45722,45723,45724,45725,45726,45727,45728,45729,45730,45731,45732,45733,45734,45735,45736,45737,45738,45739,45740,45741,45742,45743,45744,45745,45746,45747]
["März",{"$f":"IF(ISNA(VLOOKUP(B9,'Feiertage und Ferien'!$A:$D,3,FALSE)),IF(OR(WEEKDAY(B9)=1,WEEKDAY(B9)=7),\"\",Erfassung!$B$2*SUM(Erfassung!$I2:$I2)/5),\"F\")","v":""},{"$f":"IF(ISNA(VLOOKUP(C9,'Feiertage und Ferien'!$A:$D,3,FALSE)),IF(OR(WEEKDAY(C9)=1,WEEKDAY(C9)=7),\"\",Erfassung!$B$2*SUM(Erfassung!$I2:$I2)/5),\"F\")","v":""},{"$f":"IF(ISNA(VLOOKUP(D9,'Feiertage und Ferien'!$A:$D,3,FALSE)),IF(OR(WEEKDAY(D9)=1,WEEKDAY(D9)=7),\"\",Erfassung!$B$2*SUM(Erfassung!$I2:$I2)/5),\"F\")","v":6.7200000000000006},{"$f":"IF(ISNA(VLOOKUP(E9,'Feiertage und Ferien'!$A:$D,3,FALSE)),IF(OR(WEEKDAY(E9)=1,WEEKDAY(E9)=7),\"\",Erfassung!$B$2*SUM(Erfassung!$I2:$I2)/5),\"F\")","v":6.7200000000000006},{"$f":"IF(ISNA(VLOOKUP(F9,'Feiertage und Ferien'!$A:$D,3,FALSE)),IF(OR(WEEKDAY(F9)=1,WEEKDAY(F9)=7),\"\",Erfassung!$B$2*SUM(Erfassung!$I2:$I2)/5),\"F\")","v":6.7200000000000006},{"$f":"IF(ISNA(VLOOKUP(G9,'Feiertage und Ferien'!$A:$D,3,FALSE)),IF(OR(WEEKDAY(G9)=1,WEEKDAY(G9)=7),\"\",Erfassung!$B$2*SUM(Erfassung!$I2:$I2)/5),\"F\")","v":6.7200000000000006},{"$f":"IF(ISNA(VLOOKUP(H9,'Feiertage und Ferien'!$A:$D,3,FALSE)),IF(OR(WEEKDAY(H9)=1,WEEKDAY(H9)=7),\"\",Erfassung!$B$2*SUM(Erfassung!$I2:$I2)/5),\"F\")","v":6.7200000000000006},{"$f":"IF(ISNA(VLOOKUP(I9,'Feiertage und Ferien'!$A:$D,3,FALSE)),IF(OR(WEEKDAY(I9)=1,WEEKDAY(I9)=7),\"\",Erfassung!$B$2*SUM(Erfassung!$I2:$I2)/5),\"F\")","v":""},{"$f":"IF(ISNA(VLOOKUP(J9,'Feiertage und Ferien'!$A:$D,3,FALSE)),IF(OR(WEEKDAY(J9)=1,WEEKDAY(J9)=7),\"\",Erfassung!$B$2*SUM(Erfassung!$I2:$I2)/5),\"F\")","v":""},{"$f":"IF(ISNA(VLOOKUP(K9,'Feiertage und Ferien'!$A:$D,3,FALSE)),IF(OR(WEEKDAY(K9)=1,WEEKDAY(K9)=7),\"\",Erfassung!$B$2*SUM(Erfassung!$I2:$I2)/5),\"F\")","v":6.7200000000000006},{"$f":"IF(ISNA(VLOOKUP(L9,'Feiertage und Ferien'!$A:$D,3,FALSE)),IF(OR(WEEKDAY(L9)=1,WEEKDAY(L9)=7),\"\",Erfassung!$B$2*SUM(Erfassung!$I2:$I2)/5),\"F\")","v":6.7200000000000006},{"$f":"IF(ISNA(VLOOKUP(M9,'Feiertage und Ferien'!$A:$D,3,FALSE)),IF(OR(WEEKDAY(M9)=1,WEEKDAY(M9)=7),\"\",Erfassung!$B$2*SUM(Erfassung!$I2:$I2)/5),\"F\")","v":6.7200000000000006},{"$f":"IF(ISNA(VLOOKUP(N9,'Feiertage und Ferien'!$A:$D,3,FALSE)),IF(OR(WEEKDAY(N9)=1,WEEKDAY(N9)=7),\"\",Erfassung!$B$2*SUM(Erfassung!$I2:$I2)/5),\"F\")","v":6.7200000000000006},{"$f":"IF(ISNA(VLOOKUP(O9,'Feiertage und Ferien'!$A:$D,3,FALSE)),IF(OR(WEEKDAY(O9)=1,WEEKDAY(O9)=7),\"\",Erfassung!$B$2*SUM(Erfassung!$I2:$I2)/5),\"F\")","v":6.7200000000000006},{"$f":"IF(ISNA(VLOOKUP(P9,'Feiertage und Ferien'!$A:$D,3,FALSE)),IF(OR(WEEKDAY(P9)=1,WEEKDAY(P9)=7),\"\",Erfassung!$B$2*SUM(Erfassung!$I2:$I2)/5),\"F\")","v":""},{"$f":"IF(ISNA(VLOOKUP(Q9,'Feiertage und Ferien'!$A:$D,3,FALSE)),IF(OR(WEEKDAY(Q9)=1,WEEKDAY(Q9)=7),\"\",Erfassung!$B$2*SUM(Erfassung!$I2:$I2)/5),\"F\")","v":""},{"$f":"IF(ISNA(VLOOKUP(R9,'Feiertage und Ferien'!$A:$D,3,FALSE)),IF(OR(WEEKDAY(R9)=1,WEEKDAY(R9)=7),\"\",Erfassung!$B$2*SUM(Erfassung!$I2:$I2)/5),\"F\")","v":6.7200000000000006},{"$f":"IF(ISNA(VLOOKUP(S9,'Feiertage und Ferien'!$A:$D,3,FALSE)),IF(OR(WEEKDAY(S9)=1,WEEKDAY(S9)=7),\"\",Erfassung!$B$2*SUM(Erfassung!$I2:$I2)/5),\"F\")","v":6.7200000000000006},{"$f":"IF(ISNA(VLOOKUP(T9,'Feiertage und Ferien'!$A:$D,3,FALSE)),IF(OR(WEEKDAY(T9)=1,WEEKDAY(T9)=7),\"\",Erfassung!$B$2*SUM(Erfassung!$I2:$I2)/5),\"F\")","v":6.7200000000000006},{"$f":"IF(ISNA(VLOOKUP(U9,'Feiertage und Ferien'!$A:$D,3,FALSE)),IF(OR(WEEKDAY(U9)=1,WEEKDAY(U9)=7),\"\",Erfassung!$B$2*SUM(Erfassung!$I2:$I2)/5),\"F\")","v":6.7200000000000006},{"$f":"IF(ISNA(VLOOKUP(V9,'Feiertage und Ferien'!$A:$D,3,FALSE)),IF(OR(WEEKDAY(V9)=1,WEEKDAY(V9)=7),\"\",Erfassung!$B$2*SUM(Erfassung!$I2:$I2)/5),\"F\")","v":6.7200000000000006},{"$f":"IF(ISNA(VLOOKUP(W9,'Feiertage und Ferien'!$A:$D,3,FALSE)),IF(OR(WEEKDAY(W9)=1,WEEKDAY(W9)=7),\"\",Erfassung!$B$2*SUM(Erfassung!$I2:$I2)/5),\"F\")","v":""},{"$f":"IF(ISNA(VLOOKUP(X9,'Feiertage und Ferien'!$A:$D,3,FALSE)),IF(OR(WEEKDAY(X9)=1,WEEKDAY(X9)=7),\"\",Erfassung!$B$2*SUM(Erfassung!$I2:$I2)/5),\"F\")","v":""},{"$f":"IF(ISNA(VLOOKUP(Y9,'Feiertage und Ferien'!$A:$D,3,FALSE)),IF(OR(WEEKDAY(Y9)=1,WEEKDAY(Y9)=7),\"\",Erfassung!$B$2*SUM(Erfassung!$I2:$I2)/5),\"F\")","v":6.7200000000000006},{"$f":"IF(ISNA(VLOOKUP(Z9,'Feiertage und Ferien'!$A:$D,3,FALSE)),IF(OR(WEEKDAY(Z9)=1,WEEKDAY(Z9)=7),\"\",Erfassung!$B$2*SUM(Erfassung!$I2:$I2)/5),\"F\")","v":6.7200000000000006},{"$f":"IF(ISNA(VLOOKUP(AA9,'Feiertage und Ferien'!$A:$D,3,FALSE)),IF(OR(WEEKDAY(AA9)=1,WEEKDAY(AA9)=7),\"\",Erfassung!$B$2*SUM(Erfassung!$I2:$I2)/5),\"F\")","v":6.7200000000000006},{"$f":"IF(ISNA(VLOOKUP(AB9,'Feiertage und Ferien'!$A:$D,3,FALSE)),IF(OR(WEEKDAY(AB9)=1,WEEKDAY(AB9)=7),\"\",Erfassung!$B$2*SUM(Erfassung!$I2:$I2)/5),\"F\")","v":6.7200000000000006},{"$f":"IF(ISNA(VLOOKUP(AC9,'Feiertage und Ferien'!$A:$D,3,FALSE)),IF(OR(WEEKDAY(AC9)=1,WEEKDAY(AC9)=7),\"\",Erfassung!$B$2*SUM(Erfassung!$I2:$I2)/5),\"F\")","v":6.7200000000000006},{"$f":"IF(ISNA(VLOOKUP(AD9,'Feiertage und Ferien'!$A:$D,3,FALSE)),IF(OR(WEEKDAY(AD9)=1,WEEKDAY(AD9)=7),\"\",Erfassung!$B$2*SUM(Erfassung!$I2:$I2)/5),\"F\")","v":""},{"$f":"IF(ISNA(VLOOKUP(AE9,'Feiertage und Ferien'!$A:$D,3,FALSE)),IF(OR(WEEKDAY(AE9)=1,WEEKDAY(AE9)=7),\"\",Erfassung!$B$2*SUM(Erfassung!$I2:$I2)/5),\"F\")","v":""},{"$f":"IF(ISNA(VLOOKUP(AF9,'Feiertage und Ferien'!$A:$D,3,FALSE)),IF(OR(WEEKDAY(AF9)=1,WEEKDAY(AF9)=7),\"\",Erfassung!$B$2*SUM(Erfassung!$I2:$I2)/5),\"F\")","v":6.7200000000000006},null,null,{"$f":"Erfassung!I2+20%","v":1},"März"]
[null,{"$f":"IF(B10=\"F\",B10,Arbeitstage!B9)","v":""},{"$f":"IF(C10=\"F\",C10,Arbeitstage!C9)","v":""},{"$f":"IF(D10=\"F\",D10,Arbeitstage!D9)","v":1},{"$f":"IF(E10=\"F\",E10,Arbeitstage!E9)","v":1},{"$f":"IF(F10=\"F\",F10,Arbeitstage!F9)","v":1},{"$f":"IF(G10=\"F\",G10,Arbeitstage!G9)","v":1},{"$f":"IF(H10=\"F\",H10,Arbeitstage!H9)","v":1},{"$f":"IF(I10=\"F\",I10,Arbeitstage!I9)","v":""},{"$f":"IF(J10=\"F\",J10,Arbeitstage!J9)","v":""},{"$f":"IF(K10=\"F\",K10,Arbeitstage!K9)","v":1},{"$f":"IF(L10=\"F\",L10,Arbeitstage!L9)","v":1},{"$f":"IF(M10=\"F\",M10,Arbeitstage!M9)","v":1},{"$f":"IF(N10=\"F\",N10,Arbeitstage!N9)","v":1},{"$f":"IF(O10=\"F\",O10,Arbeitstage!O9)","v":1},{"$f":"IF(P10=\"F\",P10,Arbeitstage!P9)","v":""},{"$f":"IF(Q10=\"F\",Q10,Arbeitstage!Q9)","v":""},{"$f":"IF(R10=\"F\",R10,Arbeitstage!R9)","v":1},{"$f":"IF(S10=\"F\",S10,Arbeitstage!S9)","v":1},{"$f":"IF(T10=\"F\",T10,Arbeitstage!T9)","v":1},{"$f":"IF(U10=\"F\",U10,Arbeitstage!U9)","v":1},{"$f":"IF(V10=\"F\",V10,Arbeitstage!V9)","v":1},{"$f":"IF(W10=\"F\",W10,Arbeitstage!W9)","v":""},{"$f":"IF(X10=\"F\",X10,Arbeitstage!X9)","v":""},{"$f":"IF(Y10=\"F\",Y10,Arbeitstage!Y9)","v":1},{"$f":"IF(Z10=\"F\",Z10,Arbeitstage!Z9)","v":1},{"$f":"IF(AA10=\"F\",AA10,Arbeitstage!AA9)","v":1},{"$f":"IF(AB10=\"F\",AB10,Arbeitstage!AB9)","v":1},{"$f":"IF(AC10=\"F\",AC10,Arbeitstage!AC9)","v":1},{"$f":"IF(AD10=\"F\",AD10,Arbeitstage!AD9)","v":""},{"$f":"IF(AE10=\"F\",AE10,Arbeitstage!AE9)","v":""},{"$f":"IF(AF10=\"F\",AF10,Arbeitstage!AF9)","v":1},{"$f":"SUM(Erfassung!$D:$D)/12","v":2.0833333333333335},{"$f":"IF(AG11=\"\",\"\",AG11*Erfassung!B2*SUM(Erfassung!I2:I2)/5)","v":14},{"$f":"SUM(B11:AF11)","v":21},{"$f":"SUM(B10:AF10)","v":141.12},{"$f":"ROUND(AI11*AI10/5,1)*5","v":21}]
[null,{"$f":"AF9+1","v":"2025-04-01"},{"$f":"B12+1","v":45749},45750,45751,45752,45753,45754,45755,45756,45757,45758,45759,45760,45761,45762,45763,45764,45765,45766,45767,45768,45769,45770,45771,45772,45773,45774,45775,45776,45777]
["April",{"$f":"IF(ISNA(VLOOKUP(B12,'Feiertage und Ferien'!$A:$D,3,FALSE)),IF(OR(WEEKDAY(B12)=1,WEEKDAY(B12)=7),\"\",Erfassung!$B$2*SUM(Erfassung!$J2:$J2)/5),\"F\")","v":6.7200000000000006},{"$f":"IF(ISNA(VLOOKUP(C12,'Feiertage und Ferien'!$A:$D,3,FALSE)),IF(OR(WEEKDAY(C12)=1,WEEKDAY(C12)=7),\"\",Erfassung!$B$2*SUM(Erfassung!$J2:$J2)/5),\"F\")","v":6.7200000000000006},{"$f":"IF(ISNA(VLOOKUP(D12,'Feiertage und Ferien'!$A:$D,3,FALSE)),IF(OR(WEEKDAY(D12)=1,WEEKDAY(D12)=7),\"\",Erfassung!$B$2*SUM(Erfassung!$J2:$J2)/5),\"F\")","v":6.7200000000000006},{"$f":"IF(ISNA(VLOOKUP(E12,'Feiertage und Ferien'!$A:$D,3,FALSE)),IF(OR(WEEKDAY(E12)=1,WEEKDAY(E12)=7),\"\",Erfassung!$B$2*SUM(Erfassung!$J2:$J2)/5),\"F\")","v":6.7200000000000006},{"$f":"IF(ISNA(VLOOKUP(F12,'Feiertage und Ferien'!$A:$D,3,FALSE)),IF(OR(WEEKDAY(F12)=1,WEEKDAY(F12)=7),\"\",Erfassung!$B$2*SUM(Erfassung!$J2:$J2)/5),\"F\")","v":""},{"$f":"IF(ISNA(VLOOKUP(G12,'Feiertage und Ferien'!$A:$D,3,FALSE)),IF(OR(WEEKDAY(G12)=1,WEEKDAY(G12)=7),\"\",Erfassung!$B$2*SUM(Erfassung!$J2:$J2)/5),\"F\")","v":""},{"$f":"IF(ISNA(VLOOKUP(H12,'Feiertage und Ferien'!$A:$D,3,FALSE)),IF(OR(WEEKDAY(H12)=1,WEEKDAY(H12)=7),\"\",Erfassung!$B$2*SUM(Erfassung!$J2:$J2)/5),\"F\")","v":6.7200000000000006},{"$f":"IF(ISNA(VLOOKUP(I12,'Feiertage und Ferien'!$A:$D,3,FALSE)),IF(OR(WEEKDAY(I12)=1,WEEKDAY(I12)=7),\"\",Erfassung!$B$2*SUM(Erfassung!$J2:$J2)/5),\"F\")","v":6.7200000000000006},{"$f":"IF(ISNA(VLOOKUP(J12,'Feiertage und Ferien'!$A:$D,3,FALSE)),IF(OR(WEEKDAY(J12)=1,WEEKDAY(J12)=7),\"\",Erfassung!$B$2*SUM(Erfassung!$J2:$J2)/5),\"F\")","v":6.7200000000000006},{"$f":"IF(ISNA(VLOOKUP(K12,'Feiertage und Ferien'!$A:$D,3,FALSE)),IF(OR(WEEKDAY(K12)=1,WEEKDAY(K12)=7),\"\",Erfassung!$B$2*SUM(Erfassung!$J2:$J2)/5),\"F\")","v":6.7200000000000006},{"$f":"IF(ISNA(VLOOKUP(L12,'Feiertage und Ferien'!$A:$D,3,FALSE)),IF(OR(WEEKDAY(L12)=1,WEEKDAY(L12)=7),\"\",Erfassung!$B$2*SUM(Erfassung!$J2:$J2)/5),\"F\")","v":6.7200000000000006},{"$f":"IF(ISNA(VLOOKUP(M12,'Feiertage und Ferien'!$A:$D,3,FALSE)),IF(OR(WEEKDAY(M12)=1,WEEKDAY(M12)=7),\"\",Erfassung!$B$2*SUM(Erfassung!$J2:$J2)/5),\"F\")","v":""},{"$f":"IF(ISNA(VLOOKUP(N12,'Feiertage und Ferien'!$A:$D,3,FALSE)),IF(OR(WEEKDAY(N12)=1,WEEKDAY(N12)=7),\"\",Erfassung!$B$2*SUM(Erfassung!$J2:$J2)/5),\"F\")","v":""},{"$f":"IF(ISNA(VLOOKUP(O12,'Feiertage und Ferien'!$A:$D,3,FALSE)),IF(OR(WEEKDAY(O12)=1,WEEKDAY(O12)=7),\"\",Erfassung!$B$2*SUM(Erfassung!$J2:$J2)/5),\"F\")","v":6.7200000000000006},{"$f":"IF(ISNA(VLOOKUP(P12,'Feiertage und Ferien'!$A:$D,3,FALSE)),IF(OR(WEEKDAY(P12)=1,WEEKDAY(P12)=7),\"\",Erfassung!$B$2*SUM(Erfassung!$J2:$J2)/5),\"F\")","v":6.7200000000000006},{"$f":"IF(ISNA(VLOOKUP(Q12,'Feiertage und Ferien'!$A:$D,3,FALSE)),IF(OR(WEEKDAY(Q12)=1,WEEKDAY(Q12)=7),\"\",Erfassung!$B$2*SUM(Erfassung!$J2:$J2)/5),\"F\")","v":6.7200000000000006},{"$f":"IF(ISNA(VLOOKUP(R12,'Feiertage und Ferien'!$A:$D,3,FALSE)),IF(OR(WEEKDAY(R12)=1,WEEKDAY(R12)=7),\"\",Erfassung!$B$2*SUM(Erfassung!$J2:$J2)/5),\"F\")","v":6.7200000000000006},{"$f":"IF(ISNA(VLOOKUP(S12,'Feiertage und Ferien'!$A:$D,3,FALSE)),IF(OR(WEEKDAY(S12)=1,WEEKDAY(S12)=7),\"\",Erfassung!$B$2*SUM(Erfassung!$J2:$J2)/5),\"F\")","v":"F"},{"$f":"IF(ISNA(VLOOKUP(T12,'Feiertage und Ferien'!$A:$D,3,FALSE)),IF(OR(WEEKDAY(T12)=1,WEEKDAY(T12)=7),\"\",Erfassung!$B$2*SUM(Erfassung!$J2:$J2)/5),\"F\")","v":""},{"$f":"IF(ISNA(VLOOKUP(U12,'Feiertage und Ferien'!$A:$D,3,FALSE)),IF(OR(WEEKDAY(U12)=1,WEEKDAY(U12)=7),\"\",Erfassung!$B$2*SUM(Erfassung!$J2:$J2)/5),\"F\")","v":""},{"$f":"IF(ISNA(VLOOKUP(V12,'Feiertage und Ferien'!$A:$D,3,FALSE)),IF(OR(WEEKDAY(V12)=1,WEEKDAY(V12)=7),\"\",Erfassung!$B$2*SUM(Erfassung!$J2:$J2)/5),\"F\")","v":"F"},{"$f":"IF(ISNA(VLOOKUP(W12,'Feiertage und Ferien'!$A:$D,3,FALSE)),IF(OR(WEEKDAY(W12)=1,WEEKDAY(W12)=7),\"\",Erfassung!$B$2*SUM(Erfassung!$J2:$J2)/5),\"F\")","v":6.7200000000000006},{"$f":"IF(ISNA(VLOOKUP(X12,'Feiertage und Ferien'!$A:$D,3,FALSE)),IF(OR(WEEKDAY(X12)=1,WEEKDAY(X12)=7),\"\",Erfassung!$B$2*SUM(Erfassung!$J2:$J2)/5),\"F\")","v":6.7200000000000006},{"$f":"IF(ISNA(VLOOKUP(Y12,'Feiertage und Ferien'!$A:$D,3,FALSE)),IF(OR(WEEKDAY(Y12)=1,WEEKDAY(Y12)=7),\"\",Erfassung!$B$2*SUM(Erfassung!$J2:$J2)/5),\"F\")","v":6.7200000000000006},{"$f":"IF(ISNA(VLOOKUP(Z12,'Feiertage und Ferien'!$A:$D,3,FALSE)),IF(OR(WEEKDAY(Z12)=1,WEEKDAY(Z12)=7),\"\",Erfassung!$B$2*SUM(Erfassung!$J2:$J2)/5),\"F\")","v":6.7200000000000006},{"$f":"IF(ISNA(VLOOKUP(AA12,'Feiertage und Ferien'!$A:$D,3,FALSE)),IF(OR(WEEKDAY(AA12)=1,WEEKDAY(AA12)=7),\"\",Erfassung!$B$2*SUM(Erfassung!$J2:$J2)/5),\"F\")","v":""},{"$f":"IF(ISNA(VLOOKUP(AB12,'Feiertage und Ferien'!$A:$D,3,FALSE)),IF(OR(WEEKDAY(AB12)=1,WEEKDAY(AB12)=7),\"\",Erfassung!$B$2*SUM(Erfassung!$J2:$J2)/5),\"F\")","v":""},{"$f":"IF(ISNA(VLOOKUP(AC12,'Feiertage und Ferien'!$A:$D,3,FALSE)),IF(OR(WEEKDAY(AC12)=1,WEEKDAY(AC12)=7),\"\",Erfassung!$B$2*SUM(Erfassung!$J2:$J2)/5),\"F\")","v":6.7200000000000006},{"$f":"IF(ISNA(VLOOKUP(AD12,'Feiertage und Ferien'!$A:$D,3,FALSE)),IF(OR(WEEKDAY(AD12)=1,WEEKDAY(AD12)=7),\"\",Erfassung!$B$2*SUM(Erfassung!$J2:$J2)/5),\"F\")","v":6.7200000000000006},{"$f":"IF(ISNA(VLOOKUP(AE12,'Feiertage und Ferien'!$A:$D,3,FALSE)),IF(OR(WEEKDAY(AE12)=1,WEEKDAY(AE12)=7),\"\",Erfassung!$B$2*SUM(Erfassung!$J2:$J2)/5),\"F\")","v":6.7200000000000006},{"$f":"IF(ISNA(VLOOKUP(AF12,'Feiertage und Ferien'!$A:$D,3,FALSE)),IF(OR(WEEKDAY(AF12)=1,WEEKDAY(AF12)=7),\"\",Erfassung!$B$2*SUM(Erfassung!$J2:$J2)/5),\"F\")","v":""},null,null,{"$f":"Erfassung!J2+20%","v":1},"April"]
[null,{"$f":"IF(B13=\"F\",B13,Arbeitstage!B11)","v":1},{"$f":"IF(C13=\"F\",C13,Arbeitstage!C11)","v":1},{"$f":"IF(D13=\"F\",D13,Arbeitstage!D11)","v":1},{"$f":"IF(E13=\"F\",E13,Arbeitstage!E11)","v":1},{"$f":"IF(F13=\"F\",F13,Arbeitstage!F11)","v":""},{"$f":"IF(G13=\"F\",G13,Arbeitstage!G11)","v":""},{"$f":"IF(H13=\"F\",H13,Arbeitstage!H11)","v":1},{"$f":"IF(I13=\"F\",I13,Arbeitstage!I11)","v":1},{"$f":"IF(J13=\"F\",J13,Arbeitstage!J11)","v":1},{"$f":"IF(K13=\"F\",K13,Arbeitstage!K11)","v":1},{"$f":"IF(L13=\"F\",L13,Arbeitstage!L11)","v":1},{"$f":"IF(M13=\"F\",M13,Arbeitstage!M11)","v":""},{"$f":"IF(N13=\"F\",N13,Arbeitstage!N11)","v":""},{"$f":"IF(O13=\"F\",O13,Arbeitstage!O11)","v":1},{"$f":"IF(P13=\"F\",P13,Arbeitstage!P11)","v":1},{"$f":"IF(Q13=\"F\",Q13,Arbeitstage!Q11)","v":1},{"$f":"IF(R13=\"F\",R13,Arbeitstage!R11)","v":1},{"$f":"IF(S13=\"F\",S13,Arbeitstage!S11)","v":"F"},{"$f":"IF(T13=\"F\",T13,Arbeitstage!T11)","v":""},{"$f":"IF(U13=\"F\",U13,Arbeitstage!U11)","v":""},{"$f":"IF(V13=\"F\",V13,Arbeitstage!V11)","v":"F"},{"$f":"IF(W13=\"F\",W13,Arbeitstage!W11)","v":1},{"$f":"IF(X13=\"F\",X13,Arbeitstage!X11)","v":1},{"$f":"IF(Y13=\"F\",Y13,Arbeitstage!Y11)","v":1},{"$f":"IF(Z13=\"F\",Z13,Arbeitstage!Z11)","v":1},{"$f":"IF(AA13=\"F\",AA13,Arbeitstage!AA11)","v":""},{"$f":"IF(AB13=\"F\",AB13,Arbeitstage!AB11)","v":""},{"$f":"IF(AC13=\"F\",AC13,Arbeitstage!AC11)","v":1},{"$f":"IF(AD13=\"F\",AD13,Arbeitstage!AD11)","v":1},{"$f":"IF(AE13=\"F\",AE13,Arbeitstage!AE11)","v":1},{"$f":"IF(AF13=\"F\",AF13,Arbeitstage!AF11)","v":""},{"$f":"SUM(Erfassung!$D:$D)/12","v":2.0833333333333335},{"$f":"IF(AG14=\"\",\"\",AG14*Erfassung!B2*SUM(Erfassung!J2:J2)/5)","v":14},{"$f":"SUM(B14:AF14)","v":20},{"$f":"SUM(B13:AF13)","v":134.4},{"$f":"ROUND(AI14*AI13/5,1)*5","v":20}]
[null,{"$f":"AE12+1","v":45778},{"$f":"B15+1","v":45779},45780,45781,45782,45783,45784,45785,45786,45787,45788,45789,45790,45791,45792,45793,45794,45795,45796,45797,45798,45799,45800,45801,45802,45803,45804,45805,45806,45807,45808]
["Mai",{"$f":"IF(ISNA(VLOOKUP(B15,'Feiertage und Ferien'!$A:$D,3,FALSE)),IF(OR(WEEKDAY(B15)=1,WEEKDAY(B15)=7),\"\",Erfassung!$B$2*SUM(Erfassung!$K2:$K2)/5),\"F\")","v":6.7200000000000006},{"$f":"IF(ISNA(VLOOKUP(C15,'Feiertage und Ferien'!$A:$D,3,FALSE)),IF(OR(WEEKDAY(C15)=1,WEEKDAY(C15)=7),\"\",Erfassung!$B$2*SUM(Erfassung!$K2:$K2)/5),\"F\")","v":6.7200000000000006},{"$f":"IF(ISNA(VLOOKUP(D15,'Feiertage und Ferien'!$A:$D,3,FALSE)),IF(OR(WEEKDAY(D15)=1,WEEKDAY(D15)=7),\"\",Erfassung!$B$2*SUM(Erfassung!$K2:$K2)/5),\"F\")","v":""},{"$f":"IF(ISNA(VLOOKUP(E15,'Feiertage und Ferien'!$A:$D,3,FALSE)),IF(OR(WEEKDAY(E15)=1,WEEKDAY(E15)=7),\"\",Erfassung!$B$2*SUM(Erfassung!$K2:$K2)/5),\"F\")","v":""},{"$f":"IF(ISNA(VLOOKUP(F15,'Feiertage und Ferien'!$A:$D,3,FALSE)),IF(OR(WEEKDAY(F15)=1,WEEKDAY(F15)=7),\"\",Erfassung!$B$2*SUM(Erfassung!$K2:$K2)/5),\"F\")","v":6.7200000000000006},{"$f":"IF(ISNA(VLOOKUP(G15,'Feiertage und Ferien'!$A:$D,3,FALSE)),IF(OR(WEEKDAY(G15)=1,WEEKDAY(G15)=7),\"\",Erfassung!$B$2*SUM(Erfassung!$K2:$K2)/5),\"F\")","v":6.7200000000000006},{"$f":"IF(ISNA(VLOOKUP(H15,'Feiertage und Ferien'!$A:$D,3,FALSE)),IF(OR(WEEKDAY(H15)=1,WEEKDAY(H15)=7),\"\",Erfassung!$B$2*SUM(Erfassung!$K2:$K2)/5),\"F\")","v":6.7200000000000006},{"$f":"IF(ISNA(VLOOKUP(I15,'Feiertage und Ferien'!$A:$D,3,FALSE)),IF(OR(WEEKDAY(I15)=1,WEEKDAY(I15)=7),\"\",Erfassung!$B$2*SUM(Erfassung!$K2:$K2)/5),\"F\")","v":6.7200000000000006},{"$f":"IF(ISNA(VLOOKUP(J15,'Feiertage und Ferien'!$A:$D,3,FALSE)),IF(OR(WEEKDAY(J15)=1,WEEKDAY(J15)=7),\"\",Erfassung!$B$2*SUM(Erfassung!$K2:$K2)/5),\"F\")","v":6.7200000000000006},{"$f":"IF(ISNA(VLOOKUP(K15,'Feiertage und Ferien'!$A:$D,3,FALSE)),IF(OR(WEEKDAY(K15)=1,WEEKDAY(K15)=7),\"\",Erfassung!$B$2*SUM(Erfassung!$K2:$K2)/5),\"F\")","v":""},{"$f":"IF(ISNA(VLOOKUP(L15,'Feiertage und Ferien'!$A:$D,3,FALSE)),IF(OR(WEEKDAY(L15)=1,WEEKDAY(L15)=7),\"\",Erfassung!$B$2*SUM(Erfassung!$K2:$K2)/5),\"F\")","v":""},{"$f":"IF(ISNA(VLOOKUP(M15,'Feiertage und Ferien'!$A:$D,3,FALSE)),IF(OR(WEEKDAY(M15)=1,WEEKDAY(M15)=7),\"\",Erfassung!$B$2*SUM(Erfassung!$K2:$K2)/5),\"F\")","v":6.7200000000000006},{"$f":"IF(ISNA(VLOOKUP(N15,'Feiertage und Ferien'!$A:$D,3,FALSE)),IF(OR(WEEKDAY(N15)=1,WEEKDAY(N15)=7),\"\",Erfassung!$B$2*SUM(Erfassung!$K2:$K2)/5),\"F\")","v":6.7200000000000006},{"$f":"IF(ISNA(VLOOKUP(O15,'Feiertage und Ferien'!$A:$D,3,FALSE)),IF(OR(WEEKDAY(O15)=1,WEEKDAY(O15)=7),\"\",Erfassung!$B$2*SUM(Erfassung!$K2:$K2)/5),\"F\")","v":6.7200000000000006},{"$f":"IF(ISNA(VLOOKUP(P15,'Feiertage und Ferien'!$A:$D,3,FALSE)),IF(OR(WEEKDAY(P15)=1,WEEKDAY(P15)=7),\"\",Erfassung!$B$2*SUM(Erfassung!$K2:$K2)/5),\"F\")","v":6.7200000000000006},{"$f":"IF(ISNA(VLOOKUP(Q15,'Feiertage und Ferien'!$A:$D,3,FALSE)),IF(OR(WEEKDAY(Q15)=1,WEEKDAY(Q15)=7),\"\",Erfassung!$B$2*SUM(Erfassung!$K2:$K2)/5),\"F\")","v":6.7200000000000006},{"$f":"IF(ISNA(VLOOKUP(R15,'Feiertage und Ferien'!$A:$D,3,FALSE)),IF(OR(WEEKDAY(R15)=1,WEEKDAY(R15)=7),\"\",Erfassung!$B$2*SUM(Erfassung!$K2:$K2)/5),\"F\")","v":""},{"$f":"IF(ISNA(VLOOKUP(S15,'Feiertage und Ferien'!$A:$D,3,FALSE)),IF(OR(WEEKDAY(S15)=1,WEEKDAY(S15)=7),\"\",Erfassung!$B$2*SUM(Erfassung!$K2:$K2)/5),\"F\")","v":""},{"$f":"IF(ISNA(VLOOKUP(T15,'Feiertage und Ferien'!$A:$D,3,FALSE)),IF(OR(WEEKDAY(T15)=1,WEEKDAY(T15)=7),\"\",Erfassung!$B$2*SUM(Erfassung!$K2:$K2)/5),\"F\")","v":6.7200000000000006},{"$f":"IF(ISNA(VLOOKUP(U15,'Feiertage und Ferien'!$A:$D,3,FALSE)),IF(OR(WEEKDAY(U15)=1,WEEKDAY(U15)=7),\"\",Erfassung!$B$2*SUM(Erfassung!$K2:$K2)/5),\"F\")","v":6.7200000000000006},{"$f":"IF(ISNA(VLOOKUP(V15,'Feiertage und Ferien'!$A:$D,3,FALSE)),IF(OR(WEEKDAY(V15)=1,WEEKDAY(V15)=7),\"\",Erfassung!$B$2*SUM(Erfassung!$K2:$K2)/5),\"F\")","v":6.7200000000000006},{"$f":"IF(ISNA(VLOOKUP(W15,'Feiertage und Ferien'!$A:$D,3,FALSE)),IF(OR(WEEKDAY(W15)=1,WEEKDAY(W15)=7),\"\",Erfassung!$B$2*SUM(Erfassung!$K2:$K2)/5),\"F\")","v":6.7200000000000006},{"$f":"IF(ISNA(VLOOKUP(X15,'Feiertage und Ferien'!$A:$D,3,FALSE)),IF(OR(WEEKDAY(X15)=1,WEEKDAY(X15)=7),\"\",Erfassung!$B$2*SUM(Erfassung!$K2:$K2)/5),\"F\")","v":6.7200000000000006},{"$f":"IF(ISNA(VLOOKUP(Y15,'Feiertage und Ferien'!$A:$D,3,FALSE)),IF(OR(WEEKDAY(Y15)=1,WEEKDAY(Y15)=7),\"\",Erfassung!$B$2*SUM(Erfassung!$K2:$K2)/5),\"F\")","v":""},{"$f":"IF(ISNA(VLOOKUP(Z15,'Feiertage und Ferien'!$A:$D,3,FALSE)),IF(OR(WEEKDAY(Z15)=1,WEEKDAY(Z15)=7),\"\",Erfassung!$B$2*SUM(Erfassung!$K2:$K2)/5),\"F\")","v":""},{"$f":"IF(ISNA(VLOOKUP(AA15,'Feiertage und Ferien'!$A:$D,3,FALSE)),IF(OR(WEEKDAY(AA15)=1,WEEKDAY(AA15)=7),\"\",Erfassung!$B$2*SUM(Erfassung!$K2:$K2)/5),\"F\")","v":6.7200000000000006},{"$f":"IF(ISNA(VLOOKUP(AB15,'Feiertage und Ferien'!$A:$D,3,FALSE)),IF(OR(WEEKDAY(AB15)=1,WEEKDAY(AB15)=7),\"\",Erfassung!$B$2*SUM(Erfassung!$K2:$K2)/5),\"F\")","v":6.7200000000000006},{"$f":"IF(ISNA(VLOOKUP(AC15,'Feiertage und Ferien'!$A:$D,3,FALSE)),IF(OR(WEEKDAY(AC15)=1,WEEKDAY(AC15)=7),\"\",Erfassung!$B$2*SUM(Erfassung!$K2:$K2)/5),\"F\")","v":6.7200000000000006},{"$f":"IF(ISNA(VLOOKUP(AD15,'Feiertage und Ferien'!$A:$D,3,FALSE)),IF(OR(WEEKDAY(AD15)=1,WEEKDAY(AD15)=7),\"\",Erfassung!$B$2*SUM(Erfassung!$K2:$K2)/5),\"F\")","v":"F"},{"$f":"IF(ISNA(VLOOKUP(AE15,'Feiertage und Ferien'!$A:$D,3,FALSE)),IF(OR(WEEKDAY(AE15)=1,WEEKDAY(AE15)=7),\"\",Erfassung!$B$2*SUM(Erfassung!$K2:$K2)/5),\"F\")","v":6.7200000000000006},{"$f":"IF(ISNA(VLOOKUP(AF15,'Feiertage und Ferien'!$A:$D,3,FALSE)),IF(OR(WEEKDAY(AF15)=1,WEEKDAY(AF15)=7),\"\",Erfassung!$B$2*SUM(Erfassung!$K2:$K2)/5),\"F\")","v":""},null,null,{"$f":"Erfassung!K2+20%","v":1},"Mai"]
[null,{"$f":"IF(B16=\"F\",B16,Arbeitstage!B13)","v":1},{"$f":"IF(C16=\"F\",C16,Arbeitstage!C13)","v":1},{"$f":"IF(D16=\"F\",D16,Arbeitstage!D13)","v":"F"},{"$f":"IF(E16=\"F\",E16,Arbeitstage!E13)","v":"F"},{"$f":"IF(F16=\"F\",F16,Arbeitstage!F13)","v":"F"},{"$f":"IF(G16=\"F\",G16,Arbeitstage!G13)","v":"F"},{"$f":"IF(H16=\"F\",H16,Arbeitstage!H13)","v":"F"},{"$f":"IF(I16=\"F\",I16,Arbeitstage!I13)","v":"F"},{"$f":"IF(J16=\"F\",J16,Arbeitstage!J13)","v":"F"},{"$f":"IF(K16=\"F\",K16,Arbeitstage!K13)","v":"F"},{"$f":"IF(L16=\"F\",L16,Arbeitstage!L13)","v":"F"},{"$f":"IF(M16=\"F\",M16,Arbeitstage!M13)","v":"F"},{"$f":"IF(N16=\"F\",N16,Arbeitstage!N13)","v":"F"},{"$f":"IF(O16=\"F\",O16,Arbeitstage!O13)","v":"F"},{"$f":"IF(P16=\"F\",P16,Arbeitstage!P13)","v":"F"},{"$f":"IF(Q16=\"F\",Q16,Arbeitstage!Q13)","v":"F"},{"$f":"IF(R16=\"F\",R16,Arbeitstage!R13)","v":"F"},{"$f":"IF(S16=\"F\",S16,Arbeitstage!S13)","v":""},{"$f":"IF(T16=\"F\",T16,Arbeitstage!T13)","v":1},{"$f":"IF(U16=\"F\",U16,Arbeitstage!U13)","v":1},{"$f":"IF(V16=\"F\",V16,Arbeitstage!V13)","v":1},{"$f":"IF(W16=\"F\",W16,Arbeitstage!W13)","v":1},{"$f":"IF(X16=\"F\",X16,Arbeitstage!X13)","v":1},{"$f":"IF(Y16=\"F\",Y16,Arbeitstage!Y13)","v":""},{"$f":"IF(Z16=\"F\",Z16,Arbeitstage!Z13)","v":""},{"$f":"IF(AA16=\"F\",AA16,Arbeitstage!AA13)","v":1},{"$f":"IF(AB16=\"F\",AB16,Arbeitstage!AB13)","v":1},{"$f":"IF(AC16=\"F\",AC16,Arbeitstage!AC13)","v":1},{"$f":"IF(AD16=\"F\",AD16,Arbeitstage!AD13)","v":"F"},{"$f":"IF(AE16=\"F\",AE16,Arbeitstage!AE13)","v":1},{"$f":"IF(AF16=\"F\",AF16,Arbeitstage!AF13)","v":""},{"$f":"SUM(Erfassung!$D:$D)/12","v":2.0833333333333335},{"$f":"IF(AG17=\"\",\"\",AG17*Erfassung!B2*SUM(Erfassung!K2:K2)/5)","v":14},{"$f":"SUM(B17:AF17)","v":11},{"$f":"SUM(B16:AF16)","v":141.12},{"$f":"ROUND(AI17*AI16/5,1)*5","v":11}]
[null,{"$f":"AF15+1","v":"2025-06-01"},{"$f":"B18+1","v":"2025-06-02"},"2025-06-03","2025-06-04","2025-06-05","2025-06-06","2025-06-07","2025-06-08","2025-06-09","2025-06-10","2025-06-11","2025-06-12","2025-06-13","2025-06-14","2025-06-15","2025-06-16","2025-06-17","2025-06-18","2025-06-19","2025-06-20","2025-06-21","2025-06-22","2025-06-23","2025-06-24","2025-06-25","2025-06-26","2025-06-27","2025-06-28","2025-06-29","2025-06-30"]
["Juni",{"$f":"IF(ISNA(VLOOKUP(B18,'Feiertage und Ferien'!$A:$D,3,FALSE)),IF(OR(WEEKDAY(B18)=1,WEEKDAY(B18)=7),\"\",Erfassung!$B$2*SUM(Erfassung!$L2:$L2)/5),\"F\")","v":""},{"$f":"IF(ISNA(VLOOKUP(C18,'Feiertage und Ferien'!$A:$D,3,FALSE)),IF(OR(WEEKDAY(C18)=1,WEEKDAY(C18)=7),\"\",Erfassung!$B$2*SUM(Erfassung!$L2:$L2)/5),\"F\")","v":6.7200000000000006},{"$f":"IF(ISNA(VLOOKUP(D18,'Feiertage und Ferien'!$A:$D,3,FALSE)),IF(OR(WEEKDAY(D18)=1,WEEKDAY(D18)=7),\"\",Erfassung!$B$2*SUM(Erfassung!$L2:$L2)/5),\"F\")","v":6.7200000000000006},{"$f":"IF(ISNA(VLOOKUP(E18,'Feiertage und Ferien'!$A:$D,3,FALSE)),IF(OR(WEEKDAY(E18)=1,WEEKDAY(E18)=7),\"\",Erfassung!$B$2*SUM(Erfassung!$L2:$L2)/5),\"F\")","v":6.7200000000000006},{"$f":"IF(ISNA(VLOOKUP(F18,'Feiertage und Ferien'!$A:$D,3,FALSE)),IF(OR(WEEKDAY(F18)=1,WEEKDAY(F18)=7),\"\",Erfassung!$B$2*SUM(Erfassung!$L2:$L2)/5),\"F\")","v":6.7200000000000006},{"$f":"IF(ISNA(VLOOKUP(G18,'Feiertage und Ferien'!$A:$D,3,FALSE)),IF(OR(WEEKDAY(G18)=1,WEEKDAY(G18)=7),\"\",Erfassung!$B$2*SUM(Erfassung!$L2:$L2)/5),\"F\")","v":6.7200000000000006},{"$f":"IF(ISNA(VLOOKUP(H18,'Feiertage und Ferien'!$A:$D,3,FALSE)),IF(OR(WEEKDAY(H18)=1,WEEKDAY(H18)=7),\"\",Erfassung!$B$2*SUM(Erfassung!$L2:$L2)/5),\"F\")","v":""},{"$f":"IF(ISNA(VLOOKUP(I18,'Feiertage und Ferien'!$A:$D,3,FALSE)),IF(OR(WEEKDAY(I18)=1,WEEKDAY(I18)=7),\"\",Erfassung!$B$2*SUM(Erfassung!$L2:$L2)/5),\"F\")","v":""},{"$f":"IF(ISNA(VLOOKUP(J18,'Feiertage und Ferien'!$A:$D,3,FALSE)),IF(OR(WEEKDAY(J18)=1,WEEKDAY(J18)=7),\"\",Erfassung!$B$2*SUM(Erfassung!$L2:$L2)/5),\"F\")","v":"F"},{"$f":"IF(ISNA(VLOOKUP(K18,'Feiertage und Ferien'!$A:$D,3,FALSE)),IF(OR(WEEKDAY(K18)=1,WEEKDAY(K18)=7),\"\",Erfassung!$B$2*SUM(Erfassung!$L2:$L2)/5),\"F\")","v":6.7200000000000006},{"$f":"IF(ISNA(VLOOKUP(L18,'Feiertage und Ferien'!$A:$D,3,FALSE)),IF(OR(WEEKDAY(L18)=1,WEEKDAY(L18)=7),\"\",Erfassung!$B$2*SUM(Erfassung!$L2:$L2)/5),\"F\")","v":6.7200000000000006},{"$f":"IF(ISNA(VLOOKUP(M18,'Feiertage und Ferien'!$A:$D,3,FALSE)),IF(OR(WEEKDAY(M18)=1,WEEKDAY(M18)=7),\"\",Erfassung!$B$2*SUM(Erfassung!$L2:$L2)/5),\"F\")","v":6.7200000000000006},{"$f":"IF(ISNA(VLOOKUP(N18,'Feiertage und Ferien'!$A:$D,3,FALSE)),IF(OR(WEEKDAY(N18)=1,WEEKDAY(N18)=7),\"\",Erfassung!$B$2*SUM(Erfassung!$L2:$L2)/5),\"F\")","v":6.7200000000000006},{"$f":"IF(ISNA(VLOOKUP(O18,'Feiertage und Ferien'!$A:$D,3,FALSE)),IF(OR(WEEKDAY(O18)=1,WEEKDAY(O18)=7),\"\",Erfassung!$B$2*SUM(Erfassung!$L2:$L2)/5),\"F\")","v":""},{"$f":"IF(ISNA(VLOOKUP(P18,'Feiertage und Ferien'!$A:$D,3,FALSE)),IF(OR(WEEKDAY(P18)=1,WEEKDAY(P18)=7),\"\",Erfassung!$B$2*SUM(Erfassung!$L2:$L2)/5),\"F\")","v":""},{"$f":"IF(ISNA(VLOOKUP(Q18,'Feiertage und Ferien'!$A:$D,3,FALSE)),IF(OR(WEEKDAY(Q18)=1,WEEKDAY(Q18)=7),\"\",Erfassung!$B$2*SUM(Erfassung!$L2:$L2)/5),\"F\")","v":6.7200000000000006},{"$f":"IF(ISNA(VLOOKUP(R18,'Feiertage und Ferien'!$A:$D,3,FALSE)),IF(OR(WEEKDAY(R18)=1,WEEKDAY(R18)=7),\"\",Erfassung!$B$2*SUM(Erfassung!$L2:$L2)/5),\"F\")","v":6.7200000000000006},{"$f":"IF(ISNA(VLOOKUP(S18,'Feiertage und Ferien'!$A:$D,3,FALSE)),IF(OR(WEEKDAY(S18)=1,WEEKDAY(S18)=7),\"\",Erfassung!$B$2*SUM(Erfassung!$L2:$L2)/5),\"F\")","v":6.7200000000000006},{"$f":"IF(ISNA(VLOOKUP(T18,'Feiertage und Ferien'!$A:$D,3,FALSE)),IF(OR(WEEKDAY(T18)=1,WEEKDAY(T18)=7),\"\",Erfassung!$B$2*SUM(Erfassung!$L2:$L2)/5),\"F\")","v":6.7200000000000006},{"$f":"IF(ISNA(VLOOKUP(U18,'Feiertage und Ferien'!$A:$D,3,FALSE)),IF(OR(WEEKDAY(U18)=1,WEEKDAY(U18)=7),\"\",Erfassung!$B$2*SUM(Erfassung!$L2:$L2)/5),\"F\")","v":6.7200000000000006},{"$f":"IF(ISNA(VLOOKUP(V18,'Feiertage und Ferien'!$A:$D,3,FALSE)),IF(OR(WEEKDAY(V18)=1,WEEKDAY(V18)=7),\"\",Erfassung!$B$2*SUM(Erfassung!$L2:$L2)/5),\"F\")","v":""},{"$f":"IF(ISNA(VLOOKUP(W18,'Feiertage und Ferien'!$A:$D,3,FALSE)),IF(OR(WEEKDAY(W18)=1,WEEKDAY(W18)=7),\"\",Erfassung!$B$2*SUM(Erfassung!$L2:$L2)/5),\"F\")","v":""},{"$f":"IF(ISNA(VLOOKUP(X18,'Feiertage und Ferien'!$A:$D,3,FALSE)),IF(OR(WEEKDAY(X18)=1,WEEKDAY(X18)=7),\"\",Erfassung!$B$2*SUM(Erfassung!$L2:$L2)/5),\"F\")","v":6.7200000000000006},{"$f":"IF(ISNA(VLOOKUP(Y18,'Feiertage und Ferien'!$A:$D,3,FALSE)),IF(OR(WEEKDAY(Y18)=1,WEEKDAY(Y18)=7),\"\",Erfassung!$B$2*SUM(Erfassung!$L2:$L2)/5),\"F\")","v":6.7200000000000006},{"$f":"IF(ISNA(VLOOKUP(Z18,'Feiertage und Ferien'!$A:$D,3,FALSE)),IF(OR(WEEKDAY(Z18)=1,WEEKDAY(Z18)=7),\"\",Erfassung!$B$2*SUM(Erfassung!$L2:$L2)/5),\"F\")","v":6.7200000000000006},{"$f":"IF(ISNA(VLOOKUP(AA18,'Feiertage und Ferien'!$A:$D,3,FALSE)),IF(OR(WEEKDAY(AA18)=1,WEEKDAY(AA18)=7),\"\",Erfassung!$B$2*SUM(Erfassung!$L2:$L2)/5),\"F\")","v":6.7200000000000006},{"$f":"IF(ISNA(VLOOKUP(AB18,'Feiertage und Ferien'!$A:$D,3,FALSE)),IF(OR(WEEKDAY(AB18)=1,WEEKDAY(AB18)=7),\"\",Erfassung!$B$2*SUM(Erfassung!$L2:$L2)/5),\"F\")","v":6.7200000000000006},{"$f":"IF(ISNA(VLOOKUP(AC18,'Feiertage und Ferien'!$A:$D,3,FALSE)),IF(OR(WEEKDAY(AC18)=1,WEEKDAY(AC18)=7),\"\",Erfassung!$B$2*SUM(Erfassung!$L2:$L2)/5),\"F\")","v":""},{"$f":"IF(ISNA(VLOOKUP(AD18,'Feiertage und Ferien'!$A:$D,3,FALSE)),IF(OR(WEEKDAY(AD18)=1,WEEKDAY(AD18)=7),\"\",Erfassung!$B$2*SUM(Erfassung!$L2:$L2)/5),\"F\")","v":""},{"$f":"IF(ISNA(VLOOKUP(AE18,'Feiertage und Ferien'!$A:$D,3,FALSE)),IF(OR(WEEKDAY(AE18)=1,WEEKDAY(AE18)=7),\"\",Erfassung!$B$2*SUM(Erfassung!$L2:$L2)/5),\"F\")","v":6.7200000000000006},{"$f":"IF(ISNA(VLOOKUP(AF18,'Feiertage und Ferien'!$A:$D,3,FALSE)),IF(OR(WEEKDAY(AF18)=1,WEEKDAY(AF18)=7),\"\",Erfassung!$B$2*SUM(Erfassung!$L2:$L2)/5),\"F\")","v":""},null,null,{"$f":"Erfassung!L2+20%","v":1},"Juni"]
[null,{"$f":"IF(B19=\"F\",B19,Arbeitstage!B15)","v":""},{"$f":"IF(C19=\"F\",C19,Arbeitstage!C15)","v":1},{"$f":"IF(D19=\"F\",D19,Arbeitstage!D15)","v":1},{"$f":"IF(E19=\"F\",E19,Arbeitstage!E15)","v":1},{"$f":"IF(F19=\"F\",F19,Arbeitstage!F15)","v":1},{"$f":"IF(G19=\"F\",G19,Arbeitstage!G15)","v":1},{"$f":"IF(H19=\"F\",H19,Arbeitstage!H15)","v":""},{"$f":"IF(I19=\"F\",I19,Arbeitstage!I15)","v":""},{"$f":"IF(J19=\"F\",J19,Arbeitstage!J15)","v":"F"},{"$f":"IF(K19=\"F\",K19,Arbeitstage!K15)","v":1},{"$f":"IF(L19=\"F\",L19,Arbeitstage!L15)","v":1},{"$f":"IF(M19=\"F\",M19,Arbeitstage!M15)","v":1},{"$f":"IF(N19=\"F\",N19,Arbeitstage!N15)","v":1},{"$f":"IF(O19=\"F\",O19,Arbeitstage!O15)","v":""},{"$f":"IF(P19=\"F\",P19,Arbeitstage!P15)","v":""},{"$f":"IF(Q19=\"F\",Q19,Arbeitstage!Q15)","v":1},{"$f":"IF(R19=\"F\",R19,Arbeitstage!R15)","v":1},{"$f":"IF(S19=\"F\",S19,Arbeitstage!S15)","v":1},{"$f":"IF(T19=\"F\",T19,Arbeitstage!T15)","v":1},{"$f":"IF(U19=\"F\",U19,Arbeitstage!U15)","v":1},{"$f":"IF(V19=\"F\",V19,Arbeitstage!V15)","v":""},{"$f":"IF(W19=\"F\",W19,Arbeitstage!W15)","v":""},{"$f":"IF(X19=\"F\",X19,Arbeitstage!X15)","v":1},{"$f":"IF(Y19=\"F\",Y19,Arbeitstage!Y15)","v":1},{"$f":"IF(Z19=\"F\",Z19,Arbeitstage!Z15)","v":1},{"$f":"IF(AA19=\"F\",AA19,Arbeitstage!AA15)","v":1},{"$f":"IF(AB19=\"F\",AB19,Arbeitstage!AB15)","v":1},{"$f":"IF(AC19=\"F\",AC19,Arbeitstage!AC15)","v":""},{"$f":"IF(AD19=\"F\",AD19,Arbeitstage!AD15)","v":""},{"$f":"IF(AE19=\"F\",AE19,Arbeitstage!AE15)","v":1},{"$f":"IF(AF19=\"F\",AF19,Arbeitstage!AF15)","v":""},{"$f":"SUM(Erfassung!$D:$D)/12","v":2.0833333333333335},{"$f":"IF(AG20=\"\",\"\",AG20*Erfassung!B2*SUM(Erfassung!L2:L2)/5)","v":14},{"$f":"SUM(B20:AF20)","v":20},{"$f":"SUM(B19:AF19)","v":134.4},{"$f":"ROUND(AI20*AI19/5,1)*5","v":20}]
[null,{"$f":"AE18+1","v":"2025-07-01"},{"$f":"B21+1","v":45840},45841,45842,45843,45844,45845,45846,45847,45848,45849,45850,45851,45852,45853,45854,45855,45856,45857,45858,45859,45860,45861,45862,45863,45864,45865,45866,45867,45868,45869]
["Juli",{"$f":"IF(ISNA(VLOOKUP(B21,'Feiertage und Ferien'!$A:$D,3,FALSE)),IF(OR(WEEKDAY(B21)=1,WEEKDAY(B21)=7),\"\",Erfassung!$B$2*SUM(Erfassung!$M2:$M2)/5),\"F\")","v":6.7200000000000006},{"$f":"IF(ISNA(VLOOKUP(C21,'Feiertage und Ferien'!$A:$D,3,FALSE)),IF(OR(WEEKDAY(C21)=1,WEEKDAY(C21)=7),\"\",Erfassung!$B$2*SUM(Erfassung!$M2:$M2)/5),\"F\")","v":6.7200000000000006},{"$f":"IF(ISNA(VLOOKUP(D21,'Feiertage und Ferien'!$A:$D,3,FALSE)),IF(OR(WEEKDAY(D21)=1,WEEKDAY(D21)=7),\"\",Erfassung!$B$2*SUM(Erfassung!$M2:$M2)/5),\"F\")","v":6.7200000000000006},{"$f":"IF(ISNA(VLOOKUP(E21,'Feiertage und Ferien'!$A:$D,3,FALSE)),IF(OR(WEEKDAY(E21)=1,WEEKDAY(E21)=7),\"\",Erfassung!$B$2*SUM(Erfassung!$M2:$M2)/5),\"F\")","v":6.7200000000000006},{"$f":"IF(ISNA(VLOOKUP(F21,'Feiertage und Ferien'!$A:$D,3,FALSE)),IF(OR(WEEKDAY(F21)=1,WEEKDAY(F21)=7),\"\",Erfassung!$B$2*SUM(Erfassung!$M2:$M2)/5),\"F\")","v":""},{"$f":"IF(ISNA(VLOOKUP(G21,'Feiertage und Ferien'!$A:$D,3,FALSE)),IF(OR(WEEKDAY(G21)=1,WEEKDAY(G21)=7),\"\",Erfassung!$B$2*SUM(Erfassung!$M2:$M2)/5),\"F\")","v":""},{"$f":"IF(ISNA(VLOOKUP(H21,'Feiertage und Ferien'!$A:$D,3,FALSE)),IF(OR(WEEKDAY(H21)=1,WEEKDAY(H21)=7),\"\",Erfassung!$B$2*SUM(Erfassung!$M2:$M2)/5),\"F\")","v":6.7200000000000006},{"$f":"IF(ISNA(VLOOKUP(I21,'Feiertage und Ferien'!$A:$D,3,FALSE)),IF(OR(WEEKDAY(I21)=1,WEEKDAY(I21)=7),\"\",Erfassung!$B$2*SUM(Erfassung!$M2:$M2)/5),\"F\")","v":6.7200000000000006},{"$f":"IF(ISNA(VLOOKUP(J21,'Feiertage und Ferien'!$A:$D,3,FALSE)),IF(OR(WEEKDAY(J21)=1,WEEKDAY(J21)=7),\"\",Erfassung!$B$2*SUM(Erfassung!$M2:$M2)/5),\"F\")","v":6.7200000000000006},{"$f":"IF(ISNA(VLOOKUP(K21,'Feiertage und Ferien'!$A:$D,3,FALSE)),IF(OR(WEEKDAY(K21)=1,WEEKDAY(K21)=7),\"\",Erfassung!$B$2*SUM(Erfassung!$M2:$M2)/5),\"F\")","v":6.7200000000000006},{"$f":"IF(ISNA(VLOOKUP(L21,'Feiertage und Ferien'!$A:$D,3,FALSE)),IF(OR(WEEKDAY(L21)=1,WEEKDAY(L21)=7),\"\",Erfassung!$B$2*SUM(Erfassung!$M2:$M2)/5),\"F\")","v":6.7200000000000006},{"$f":"IF(ISNA(VLOOKUP(M21,'Feiertage und Ferien'!$A:$D,3,FALSE)),IF(OR(WEEKDAY(M21)=1,WEEKDAY(M21)=7),\"\",Erfassung!$B$2*SUM(Erfassung!$M2:$M2)/5),\"F\")","v":""},{"$f":"IF(ISNA(VLOOKUP(N21,'Feiertage und Ferien'!$A:$D,3,FALSE)),IF(OR(WEEKDAY(N21)=1,WEEKDAY(N21)=7),\"\",Erfassung!$B$2*SUM(Erfassung!$M2:$M2)/5),\"F\")","v":""},{"$f":"IF(ISNA(VLOOKUP(O21,'Feiertage und Ferien'!$A:$D,3,FALSE)),IF(OR(WEEKDAY(O21)=1,WEEKDAY(O21)=7),\"\",Erfassung!$B$2*SUM(Erfassung!$M2:$M2)/5),\"F\")","v":6.7200000000000006},{"$f":"IF(ISNA(VLOOKUP(P21,'Feiertage und Ferien'!$A:$D,3,FALSE)),IF(OR(WEEKDAY(P21)=1,WEEKDAY(P21)=7),\"\",Erfassung!$B$2*SUM(Erfassung!$M2:$M2)/5),\"F\")","v":6.7200000000000006},{"$f":"IF(ISNA(VLOOKUP(Q21,'Feiertage und Ferien'!$A:$D,3,FALSE)),IF(OR(WEEKDAY(Q21)=1,WEEKDAY(Q21)=7),\"\",Erfassung!$B$2*SUM(Erfassung!$M2:$M2)/5),\"F\")","v":6.7200000000000006},{"$f":"IF(ISNA(VLOOKUP(R21,'Feiertage und Ferien'!$A:$D,3,FALSE)),IF(OR(WEEKDAY(R21)=1,WEEKDAY(R21)=7),\"\",Erfassung!$B$2*SUM(Erfassung!$M2:$M2)/5),\"F\")","v":6.7200000000000006},{"$f":"IF(ISNA(VLOOKUP(S21,'Feiertage und Ferien'!$A:$D,3,FALSE)),IF(OR(WEEKDAY(S21)=1,WEEKDAY(S21)=7),\"\",Erfassung!$B$2*SUM(Erfassung!$M2:$M2)/5),\"F\")","v":6.7200000000000006},{"$f":"IF(ISNA(VLOOKUP(T21,'Feiertage und Ferien'!$A:$D,3,FALSE)),IF(OR(WEEKDAY(T21)=1,WEEKDAY(T21)=7),\"\",Erfassung!$B$2*SUM(Erfassung!$M2:$M2)/5),\"F\")","v":""},{"$f":"IF(ISNA(VLOOKUP(U21,'Feiertage und Ferien'!$A:$D,3,FALSE)),IF(OR(WEEKDAY(U21)=1,WEEKDAY(U21)=7),\"\",Erfassung!$B$2*SUM(Erfassung!$M2:$M2)/5),\"F\")","v":""},{"$f":"IF(ISNA(VLOOKUP(V21,'Feiertage und Ferien'!$A:$D,3,FALSE)),IF(OR(WEEKDAY(V21)=1,WEEKDAY(V21)=7),\"\",Erfassung!$B$2*SUM(Erfassung!$M2:$M2)/5),\"F\")","v":6.7200000000000006},{"$f":"IF(ISNA(VLOOKUP(W21,'Feiertage und Ferien'!$A:$D,3,FALSE)),IF(OR(WEEKDAY(W21)=1,WEEKDAY(W21)=7),\"\",Erfassung!$B$2*SUM(Erfassung!$M2:$M2)/5),\"F\")","v":6.7200000000000006},{"$f":"IF(ISNA(VLOOKUP(X21,'Feiertage und Ferien'!$A:$D,3,FALSE)),IF(OR(WEEKDAY(X21)=1,WEEKDAY(X21)=7),\"\",Erfassung!$B$2*SUM(Erfassung!$M2:$M2)/5),\"F\")","v":6.7200000000000006},{"$f":"IF(ISNA(VLOOKUP(Y21,'Feiertage und Ferien'!$A:$D,3,FALSE)),IF(OR(WEEKDAY(Y21)=1,WEEKDAY(Y21)=7),\"\",Erfassung!$B$2*SUM(Erfassung!$M2:$M2)/5),\"F\")","v":6.7200000000000006},{"$f":"IF(ISNA(VLOOKUP(Z21,'Feiertage und Ferien'!$A:$D,3,FALSE)),IF(OR(WEEKDAY(Z21)=1,WEEKDAY(Z21)=7),\"\",Erfassung!$B$2*SUM(Erfassung!$M2:$M2)/5),\"F\")","v":6.7200000000000006},{"$f":"IF(ISNA(VLOOKUP(AA21,'Feiertage und Ferien'!$A:$D,3,FALSE)),IF(OR(WEEKDAY(AA21)=1,WEEKDAY(AA21)=7),\"\",Erfassung!$B$2*SUM(Erfassung!$M2:$M2)/5),\"F\")","v":""},{"$f":"IF(ISNA(VLOOKUP(AB21,'Feiertage und Ferien'!$A:$D,3,FALSE)),IF(OR(WEEKDAY(AB21)=1,WEEKDAY(AB21)=7),\"\",Erfassung!$B$2*SUM(Erfassung!$M2:$M2)/5),\"F\")","v":""},{"$f":"IF(ISNA(VLOOKUP(AC21,'Feiertage und Ferien'!$A:$D,3,FALSE)),IF(OR(WEEKDAY(AC21)=1,WEEKDAY(AC21)=7),\"\",Erfassung!$B$2*SUM(Erfassung!$M2:$M2)/5),\"F\")","v":6.7200000000000006},{"$f":"IF(ISNA(VLOOKUP(AD21,'Feiertage und Ferien'!$A:$D,3,FALSE)),IF(OR(WEEKDAY(AD21)=1,WEEKDAY(AD21)=7),\"\",Erfassung!$B$2*SUM(Erfassung!$M2:$M2)/5),\"F\")","v":6.7200000000000006},{"$f":"IF(ISNA(VLOOKUP(AE21,'Feiertage und Ferien'!$A:$D,3,FALSE)),IF(OR(WEEKDAY(AE21)=1,WEEKDAY(AE21)=7),\"\",Erfassung!$B$2*SUM(Erfassung!$M2:$M2)/5),\"F\")","v":6.7200000000000006},{"$f":"IF(ISNA(VLOOKUP(AF21,'Feiertage und Ferien'!$A:$D,3,FALSE)),IF(OR(WEEKDAY(AF21)=1,WEEKDAY(AF21)=7),\"\",Erfassung!$B$2*SUM(Erfassung!$M2:$M2)/5),\"F\")","v":6.7200000000000006},null,null,{"$f":"Erfassung!M2+20%","v":1},"Juli"]
[null,{"$f":"IF(B22=\"F\",B22,Arbeitstage!B17)","v":1},{"$f":"IF(C22=\"F\",C22,Arbeitstage!C17)","v":1},{"$f":"IF(D22=\"F\",D22,Arbeitstage!D17)","v":1},{"$f":"IF(E22=\"F\",E22,Arbeitstage!E17)","v":1},{"$f":"IF(F22=\"F\",F22,Arbeitstage!F17)","v":"F"},{"$f":"IF(G22=\"F\",G22,Arbeitstage!G17)","v":"F"},{"$f":"IF(H22=\"F\",H22,Arbeitstage!H17)","v":"F"},{"$f":"IF(I22=\"F\",I22,Arbeitstage!I17)","v":"F"},{"$f":"IF(J22=\"F\",J22,Arbeitstage!J17)","v":"F"},{"$f":"IF(K22=\"F\",K22,Arbeitstage!K17)","v":"F"},{"$f":"IF(L22=\"F\",L22,Arbeitstage!L17)","v":"F"},{"$f":"IF(M22=\"F\",M22,Arbeitstage!M17)","v":"F"},{"$f":"IF(N22=\"F\",N22,Arbeitstage!N17)","v":"F"},{"$f":"IF(O22=\"F\",O22,Arbeitstage!O17)","v":"F"},{"$f":"IF(P22=\"F\",P22,Arbeitstage!P17)","v":"F"},{"$f":"IF(Q22=\"F\",Q22,Arbeitstage!Q17)","v":"F"},{"$f":"IF(R22=\"F\",R22,Arbeitstage!R17)","v":"F"},{"$f":"IF(S22=\"F\",S22,Arbeitstage!S17)","v":"F"},{"$f":"IF(T22=\"F\",T22,Arbeitstage!T17)","v":"F"},{"$f":"IF(U22=\"F\",U22,Arbeitstage!U17)","v":"F"},{"$f":"IF(V22=\"F\",V22,Arbeitstage!V17)","v":"F"},{"$f":"IF(W22=\"F\",W22,Arbeitstage!W17)","v":"F"},{"$f":"IF(X22=\"F\",X22,Arbeitstage!X17)","v":"F"},{"$f":"IF(Y22=\"F\",Y22,Arbeitstage!Y17)","v":"F"},{"$f":"IF(Z22=\"F\",Z22,Arbeitstage!Z17)","v":"F"},{"$f":"IF(AA22=\"F\",AA22,Arbeitstage!AA17)","v":"F"},{"$f":"IF(AB22=\"F\",AB22,Arbeitstage!AB17)","v":"F"},{"$f":"IF(AC22=\"F\",AC22,Arbeitstage!AC17)","v":"F"},{"$f":"IF(AD22=\"F\",AD22,Arbeitstage!AD17)","v":"F"},{"$f":"IF(AE22=\"F\",AE22,Arbeitstage!AE17)","v":"F"},{"$f":"IF(AF22=\"F\",AF22,Arbeitstage!AF17)","v":"F"},{"$f":"SUM(Erfassung!$D:$D)/12","v":2.0833333333333335},{"$f":"IF(AG23=\"\",\"\",AG23*Erfassung!B2*SUM(Erfassung!M2:M2)/5)","v":14},{"$f":"SUM(B23:AF23)","v":4},{"$f":"SUM(B22:AF22)","v":154.56},{"$f":"ROUND(AI23*AI22/5,1)*5","v":4}]
[null,{"$f":"AF21+1","v":"2025-08-01"},{"$f":"B24+1","v":45871},45872,45873,45874,45875,45876,45877,45878,45879,45880,45881,45882,45883,45884,45885,45886,45887,45888,45889,45890,45891,45892,45893,45894,45895,45896,45897,45898,45899,45900]
["August",{"$f":"IF(ISNA(VLOOKUP(B24,'Feiertage und Ferien'!$A:$D,3,FALSE)),IF(OR(WEEKDAY(B24)=1,WEEKDAY(B24)=7),\"\",Erfassung!$B$2*SUM(Erfassung!$N2:$N2)/5),\"F\")","v":"F"},{"$f":"IF(ISNA(VLOOKUP(C24,'Feiertage und Ferien'!$A:$D,3,FALSE)),IF(OR(WEEKDAY(C24)=1,WEEKDAY(C24)=7),\"\",Erfassung!$B$2*SUM(Erfassung!$N2:$N2)/5),\"F\")","v":""},{"$f":"IF(ISNA(VLOOKUP(D24,'Feiertage und Ferien'!$A:$D,3,FALSE)),IF(OR(WEEKDAY(D24)=1,WEEKDAY(D24)=7),\"\",Erfassung!$B$2*SUM(Erfassung!$N2:$N2)/5),\"F\")","v":""},{"$f":"IF(ISNA(VLOOKUP(E24,'Feiertage und Ferien'!$A:$D,3,FALSE)),IF(OR(WEEKDAY(E24)=1,WEEKDAY(E24)=7),\"\",Erfassung!$B$2*SUM(Erfassung!$N2:$N2)/5),\"F\")","v":6.7200000000000006},{"$f":"IF(ISNA(VLOOKUP(F24,'Feiertage und Ferien'!$A:$D,3,FALSE)),IF(OR(WEEKDAY(F24)=1,WEEKDAY(F24)=7),\"\",Erfassung!$B$2*SUM(Erfassung!$N2:$N2)/5),\"F\")","v":6.7200000000000006},{"$f":"IF(ISNA(VLOOKUP(G24,'Feiertage und Ferien'!$A:$D,3,FALSE)),IF(OR(WEEKDAY(G24)=1,WEEKDAY(G24)=7),\"\",Erfassung!$B$2*SUM(Erfassung!$N2:$N2)/5),\"F\")","v":6.7200000000000006},{"$f":"IF(ISNA(VLOOKUP(H24,'Feiertage und Ferien'!$A:$D,3,FALSE)),IF(OR(WEEKDAY(H24)=1,WEEKDAY(H24)=7),\"\",Erfassung!$B$2*SUM(Erfassung!$N2:$N2)/5),\"F\")","v":6.7200000000000006},{"$f":"IF(ISNA(VLOOKUP(I24,'Feiertage und Ferien'!$A:$D,3,FALSE)),IF(OR(WEEKDAY(I24)=1,WEEKDAY(I24)=7),\"\",Erfassung!$B$2*SUM(Erfassung!$N2:$N2)/5),\"F\")","v":6.7200000000000006},{"$f":"IF(ISNA(VLOOKUP(J24,'Feiertage und Ferien'!$A:$D,3,FALSE)),IF(OR(WEEKDAY(J24)=1,WEEKDAY(J24)=7),\"\",Erfassung!$B$2*SUM(Erfassung!$N2:$N2)/5),\"F\")","v":""},{"$f":"IF(ISNA(VLOOKUP(K24,'Feiertage und Ferien'!$A:$D,3,FALSE)),IF(OR(WEEKDAY(K24)=1,WEEKDAY(K24)=7),\"\",Erfassung!$B$2*SUM(Erfassung!$N2:$N2)/5),\"F\")","v":""},{"$f":"IF(ISNA(VLOOKUP(L24,'Feiertage und Ferien'!$A:$D,3,FALSE)),IF(OR(WEEKDAY(L24)=1,WEEKDAY(L24)=7),\"\",Erfassung!$B$2*SUM(Erfassung!$N2:$N2)/5),\"F\")","v":6.7200000000000006},{"$f":"IF(ISNA(VLOOKUP(M24,'Feiertage und Ferien'!$A:$D,3,FALSE)),IF(OR(WEEKDAY(M24)=1,WEEKDAY(M24)=7),\"\",Erfassung!$B$2*SUM(Erfassung!$N2:$N2)/5),\"F\")","v":6.7200000000000006},{"$f":"IF(ISNA(VLOOKUP(N24,'Feiertage und Ferien'!$A:$D,3,FALSE)),IF(OR(WEEKDAY(N24)=1,WEEKDAY(N24)=7),\"\",Erfassung!$B$2*SUM(Erfassung!$N2:$N2)/5),\"F\")","v":6.7200000000000006},{"$f":"IF(ISNA(VLOOKUP(O24,'Feiertage und Ferien'!$A:$D,3,FALSE)),IF(OR(WEEKDAY(O24)=1,WEEKDAY(O24)=7),\"\",Erfassung!$B$2*SUM(Erfassung!$N2:$N2)/5),\"F\")","v":6.7200000000000006},{"$f":"IF(ISNA(VLOOKUP(P24,'Feiertage und Ferien'!$A:$D,3,FALSE)),IF(OR(WEEKDAY(P24)=1,WEEKDAY(P24)=7),\"\",Erfassung!$B$2*SUM(Erfassung!$N2:$N2)/5),\"F\")","v":6.7200000000000006},{"$f":"IF(ISNA(VLOOKUP(Q24,'Feiertage und Ferien'!$A:$D,3,FALSE)),IF(OR(WEEKDAY(Q24)=1,WEEKDAY(Q24)=7),\"\",Erfassung!$B$2*SUM(Erfassung!$N2:$N2)/5),\"F\")","v":""},{"$f":"IF(ISNA(VLOOKUP(R24,'Feiertage und Ferien'!$A:$D,3,FALSE)),IF(OR(WEEKDAY(R24)=1,WEEKDAY(R24)=7),\"\",Erfassung!$B$2*SUM(Erfassung!$N2:$N2)/5),\"F\")","v":""},{"$f":"IF(ISNA(VLOOKUP(S24,'Feiertage und Ferien'!$A:$D,3,FALSE)),IF(OR(WEEKDAY(S24)=1,WEEKDAY(S24)=7),\"\",Erfassung!$B$2*SUM(Erfassung!$N2:$N2)/5),\"F\")","v":6.7200000000000006},{"$f":"IF(ISNA(VLOOKUP(T24,'Feiertage und Ferien'!$A:$D,3,FALSE)),IF(OR(WEEKDAY(T24)=1,WEEKDAY(T24)=7),\"\",Erfassung!$B$2*SUM(Erfassung!$N2:$N2)/5),\"F\")","v":6.7200000000000006},{"$f":"IF(ISNA(VLOOKUP(U24,'Feiertage und Ferien'!$A:$D,3,FALSE)),IF(OR(WEEKDAY(U24)=1,WEEKDAY(U24)=7),\"\",Erfassung!$B$2*SUM(Erfassung!$N2:$N2)/5),\"F\")","v":6.7200000000000006},{"$f":"IF(ISNA(VLOOKUP(V24,'Feiertage und Ferien'!$A:$D,3,FALSE)),IF(OR(WEEKDAY(V24)=1,WEEKDAY(V24)=7),\"\",Erfassung!$B$2*SUM(Erfassung!$N2:$N2)/5),\"F\")","v":6.7200000000000006},{"$f":"IF(ISNA(VLOOKUP(W24,'Feiertage und Ferien'!$A:$D,3,FALSE)),IF(OR(WEEKDAY(W24)=1,WEEKDAY(W24)=7),\"\",Erfassung!$B$2*SUM(Erfassung!$N2:$N2)/5),\"F\")","v":6.7200000000000006},{"$f":"IF(ISNA(VLOOKUP(X24,'Feiertage und Ferien'!$A:$D,3,FALSE)),IF(OR(WEEKDAY(X24)=1,WEEKDAY(X24)=7),\"\",Erfassung!$B$2*SUM(Erfassung!$N2:$N2)/5),\"F\")","v":""},{"$f":"IF(ISNA(VLOOKUP(Y24,'Feiertage und Ferien'!$A:$D,3,FALSE)),IF(OR(WEEKDAY(Y24)=1,WEEKDAY(Y24)=7),\"\",Erfassung!$B$2*SUM(Erfassung!$N2:$N2)/5),\"F\")","v":""},{"$f":"IF(ISNA(VLOOKUP(Z24,'Feiertage und Ferien'!$A:$D,3,FALSE)),IF(OR(WEEKDAY(Z24)=1,WEEKDAY(Z24)=7),\"\",Erfassung!$B$2*SUM(Erfassung!$N2:$N2)/5),\"F\")","v":6.7200000000000006},{"$f":"IF(ISNA(VLOOKUP(AA24,'Feiertage und Ferien'!$A:$D,3,FALSE)),IF(OR(WEEKDAY(AA24)=1,WEEKDAY(AA24)=7),\"\",Erfassung!$B$2*SUM(Erfassung!$N2:$N2)/5),\"F\")","v":6.7200000000000006},{"$f":"IF(ISNA(VLOOKUP(AB24,'Feiertage und Ferien'!$A:$D,3,FALSE)),IF(OR(WEEKDAY(AB24)=1,WEEKDAY(AB24)=7),\"\",Erfassung!$B$2*SUM(Erfassung!$N2:$N2)/5),\"F\")","v":6.7200000000000006},{"$f":"IF(ISNA(VLOOKUP(AC24,'Feiertage und Ferien'!$A:$D,3,FALSE)),IF(OR(WEEKDAY(AC24)=1,WEEKDAY(AC24)=7),\"\",Erfassung!$B$2*SUM(Erfassung!$N2:$N2)/5),\"F\")","v":6.7200000000000006},{"$f":"IF(ISNA(VLOOKUP(AD24,'Feiertage und Ferien'!$A:$D,3,FALSE)),IF(OR(WEEKDAY(AD24)=1,WEEKDAY(AD24)=7),\"\",Erfassung!$B$2*SUM(Erfassung!$N2:$N2)/5),\"F\")","v":6.7200000000000006},{"$f":"IF(ISNA(VLOOKUP(AE24,'Feiertage und Ferien'!$A:$D,3,FALSE)),IF(OR(WEEKDAY(AE24)=1,WEEKDAY(AE24)=7),\"\",Erfassung!$B$2*SUM(Erfassung!$N2:$N2)/5),\"F\")","v":""},{"$f":"IF(ISNA(VLOOKUP(AF24,'Feiertage und Ferien'!$A:$D,3,FALSE)),IF(OR(WEEKDAY(AF24)=1,WEEKDAY(AF24)=7),\"\",Erfassung!$B$2*SUM(Erfassung!$N2:$N2)/5),\"F\")","v":""},null,null,{"$f":"Erfassung!N2+20%","v":1},"August"]
[null,{"$f":"IF(B25=\"F\",B25,Arbeitstage!B19)","v":"F"},{"$f":"IF(C25=\"F\",C25,Arbeitstage!C19)","v":"F"},{"$f":"IF(D25=\"F\",D25,Arbeitstage!D19)","v":"F"},{"$f":"IF(E25=\"F\",E25,Arbeitstage!E19)","v":"F"},{"$f":"IF(F25=\"F\",F25,Arbeitstage!F19)","v":"F"},{"$f":"IF(G25=\"F\",G25,Arbeitstage!G19)","v":"F"},{"$f":"IF(H25=\"F\",H25,Arbeitstage!H19)","v":"F"},{"$f":"IF(I25=\"F\",I25,Arbeitstage!I19)","v":"F"},{"$f":"IF(J25=\"F\",J25,Arbeitstage!J19)","v":"F"},{"$f":"IF(K25=\"F\",K25,Arbeitstage!K19)","v":""},{"$f":"IF(L25=\"F\",L25,Arbeitstage!L19)","v":1},{"$f":"IF(M25=\"F\",M25,Arbeitstage!M19)","v":1},{"$f":"IF(N25=\"F\",N25,Arbeitstage!N19)","v":1},{"$f":"IF(O25=\"F\",O25,Arbeitstage!O19)","v":1},{"$f":"IF(P25=\"F\",P25,Arbeitstage!P19)","v":1},{"$f":"IF(Q25=\"F\",Q25,Arbeitstage!Q19)","v":""},{"$f":"IF(R25=\"F\",R25,Arbeitstage!R19)","v":""},{"$f":"IF(S25=\"F\",S25,Arbeitstage!S19)","v":1},{"$f":"IF(T25=\"F\",T25,Arbeitstage!T19)","v":1},{"$f":"IF(U25=\"F\",U25,Arbeitstage!U19)","v":1},{"$f":"IF(V25=\"F\",V25,Arbeitstage!V19)","v":1},{"$f":"IF(W25=\"F\",W25,Arbeitstage!W19)","v":1},{"$f":"IF(X25=\"F\",X25,Arbeitstage!X19)","v":""},{"$f":"IF(Y25=\"F\",Y25,Arbeitstage!Y19)","v":""},{"$f":"IF(Z25=\"F\",Z25,Arbeitstage!Z19)","v":1},{"$f":"IF(AA25=\"F\",AA25,Arbeitstage!AA19)","v":1},{"$f":"IF(AB25=\"F\",AB25,Arbeitstage!AB19)","v":1},{"$f":"IF(AC25=\"F\",AC25,Arbeitstage!AC19)","v":1},{"$f":"IF(AD25=\"F\",AD25,Arbeitstage!AD19)","v":1},{"$f":"IF(AE25=\"F\",AE25,Arbeitstage!AE19)","v":""},{"$f":"IF(AF25=\"F\",AF25,Arbeitstage!AF19)","v":""},{"$f":"SUM(Erfassung!$D:$D)/12","v":2.0833333333333335},{"$f":"IF(AG26=\"\",\"\",AG26*Erfassung!B2*SUM(Erfassung!N2:N2)/5)","v":14},{"$f":"SUM(B26:AF26)","v":15},{"$f":"SUM(B25:AF25)","v":134.4},{"$f":"ROUND(AI26*AI25/5,1)*5","v":15}]
[null,{"$f":"AF24+1","v":45901},{"$f":"B27+1","v":45902},45903,45904,45905,45906,45907,45908,45909,45910,45911,45912,45913,45914,45915,45916,45917,45918,45919,45920,45921,45922,45923,45924,45925,45926,45927,45928,45929,45930]
["September",{"$f":"IF(ISNA(VLOOKUP(B27,'Feiertage und Ferien'!$A:$D,3,FALSE)),IF(OR(WEEKDAY(B27)=1,WEEKDAY(B27)=7),\"\",Erfassung!$B$2*SUM(Erfassung!$O2:$O2)/5),\"F\")","v":6.7200000000000006},{"$f":"IF(ISNA(VLOOKUP(C27,'Feiertage und Ferien'!$A:$D,3,FALSE)),IF(OR(WEEKDAY(C27)=1,WEEKDAY(C27)=7),\"\",Erfassung!$B$2*SUM(Erfassung!$O2:$O2)/5),\"F\")","v":6.7200000000000006},{"$f":"IF(ISNA(VLOOKUP(D27,'Feiertage und Ferien'!$A:$D,3,FALSE)),IF(OR(WEEKDAY(D27)=1,WEEKDAY(D27)=7),\"\",Erfassung!$B$2*SUM(Erfassung!$O2:$O2)/5),\"F\")","v":6.7200000000000006},{"$f":"IF(ISNA(VLOOKUP(E27,'Feiertage und Ferien'!$A:$D,3,FALSE)),IF(OR(WEEKDAY(E27)=1,WEEKDAY(E27)=7),\"\",Erfassung!$B$2*SUM(Erfassung!$O2:$O2)/5),\"F\")","v":6.7200000000000006},{"$f":"IF(ISNA(VLOOKUP(F27,'Feiertage und Ferien'!$A:$D,3,FALSE)),IF(OR(WEEKDAY(F27)=1,WEEKDAY(F27)=7),\"\",Erfassung!$B$2*SUM(Erfassung!$O2:$O2)/5),\"F\")","v":6.7200000000000006},{"$f":"IF(ISNA(VLOOKUP(G27,'Feiertage und Ferien'!$A:$D,3,FALSE)),IF(OR(WEEKDAY(G27)=1,WEEKDAY(G27)=7),\"\",Erfassung!$B$2*SUM(Erfassung!$O2:$O2)/5),\"F\")","v":""},{"$f":"IF(ISNA(VLOOKUP(H27,'Feiertage und Ferien'!$A:$D,3,FALSE)),IF(OR(WEEKDAY(H27)=1,WEEKDAY(H27)=7),\"\",Erfassung!$B$2*SUM(Erfassung!$O2:$O2)/5),\"F\")","v":""},{"$f":"IF(ISNA(VLOOKUP(I27,'Feiertage und Ferien'!$A:$D,3,FALSE)),IF(OR(WEEKDAY(I27)=1,WEEKDAY(I27)=7),\"\",Erfassung!$B$2*SUM(Erfassung!$O2:$O2)/5),\"F\")","v":6.7200000000000006},{"$f":"IF(ISNA(VLOOKUP(J27,'Feiertage und Ferien'!$A:$D,3,FALSE)),IF(OR(WEEKDAY(J27)=1,WEEKDAY(J27)=7),\"\",Erfassung!$B$2*SUM(Erfassung!$O2:$O2)/5),\"F\")","v":6.7200000000000006},{"$f":"IF(ISNA(VLOOKUP(K27,'Feiertage und Ferien'!$A:$D,3,FALSE)),IF(OR(WEEKDAY(K27)=1,WEEKDAY(K27)=7),\"\",Erfassung!$B$2*SUM(Erfassung!$O2:$O2)/5),\"F\")","v":6.7200000000000006},{"$f":"IF(ISNA(VLOOKUP(L27,'Feiertage und Ferien'!$A:$D,3,FALSE)),IF(OR(WEEKDAY(L27)=1,WEEKDAY(L27)=7),\"\",Erfassung!$B$2*SUM(Erfassung!$O2:$O2)/5),\"F\")","v":6.7200000000000006},{"$f":"IF(ISNA(VLOOKUP(M27,'Feiertage und Ferien'!$A:$D,3,FALSE)),IF(OR(WEEKDAY(M27)=1,WEEKDAY(M27)=7),\"\",Erfassung!$B$2*SUM(Erfassung!$O2:$O2)/5),\"F\")","v":6.7200000000000006},{"$f":"IF(ISNA(VLOOKUP(N27,'Feiertage und Ferien'!$A:$D,3,FALSE)),IF(OR(WEEKDAY(N27)=1,WEEKDAY(N27)=7),\"\",Erfassung!$B$2*SUM(Erfassung!$O2:$O2)/5),\"F\")","v":""},{"$f":"IF(ISNA(VLOOKUP(O27,'Feiertage und Ferien'!$A:$D,3,FALSE)),IF(OR(WEEKDAY(O27)=1,WEEKDAY(O27)=7),\"\",Erfassung!$B$2*SUM(Erfassung!$O2:$O2)/5),\"F\")","v":""},{"$f":"IF(ISNA(VLOOKUP(P27,'Feiertage und Ferien'!$A:$D,3,FALSE)),IF(OR(WEEKDAY(P27)=1,WEEKDAY(P27)=7),\"\",Erfassung!$B$2*SUM(Erfassung!$O2:$O2)/5),\"F\")","v":6.7200000000000006},{"$f":"IF(ISNA(VLOOKUP(Q27,'Feiertage und Ferien'!$A:$D,3,FALSE)),IF(OR(WEEKDAY(Q27)=1,WEEKDAY(Q27)=7),\"\",Erfassung!$B$2*SUM(Erfassung!$O2:$O2)/5),\"F\")","v":6.7200000000000006},{"$f":"IF(ISNA(VLOOKUP(R27,'Feiertage und Ferien'!$A:$D,3,FALSE)),IF(OR(WEEKDAY(R27)=1,WEEKDAY(R27)=7),\"\",Erfassung!$B$2*SUM(Erfassung!$O2:$O2)/5),\"F\")","v":6.7200000000000006},{"$f":"IF(ISNA(VLOOKUP(S27,'Feiertage und Ferien'!$A:$D,3,FALSE)),IF(OR(WEEKDAY(S27)=1,WEEKDAY(S27)=7),\"\",Erfassung!$B$2*SUM(Erfassung!$O2:$O2)/5),\"F\")","v":6.7200000000000006},{"$f":"IF(ISNA(VLOOKUP(T27,'Feiertage und Ferien'!$A:$D,3,FALSE)),IF(OR(WEEKDAY(T27)=1,WEEKDAY(T27)=7),\"\",Erfassung!$B$2*SUM(Erfassung!$O2:$O2)/5),\"F\")","v":6.7200000000000006},{"$f":"IF(ISNA(VLOOKUP(U27,'Feiertage und Ferien'!$A:$D,3,FALSE)),IF(OR(WEEKDAY(U27)=1,WEEKDAY(U27)=7),\"\",Erfassung!$B$2*SUM(Erfassung!$O2:$O2)/5),\"F\")","v":""},{"$f":"IF(ISNA(VLOOKUP(V27,'Feiertage und Ferien'!$A:$D,3,FALSE)),IF(OR(WEEKDAY(V27)=1,WEEKDAY(V27)=7),\"\",Erfassung!$B$2*SUM(Erfassung!$O2:$O2)/5),\"F\")","v":""},{"$f":"IF(ISNA(VLOOKUP(W27,'Feiertage und Ferien'!$A:$D,3,FALSE)),IF(OR(WEEKDAY(W27)=1,WEEKDAY(W27)=7),\"\",Erfassung!$B$2*SUM(Erfassung!$O2:$O2)/5),\"F\")","v":6.7200000000000006},{"$f":"IF(ISNA(VLOOKUP(X27,'Feiertage und Ferien'!$A:$D,3,FALSE)),IF(OR(WEEKDAY(X27)=1,WEEKDAY(X27)=7),\"\",Erfassung!$B$2*SUM(Erfassung!$O2:$O2)/5),\"F\")","v":6.7200000000000006},{"$f":"IF(ISNA(VLOOKUP(Y27,'Feiertage und Ferien'!$A:$D,3,FALSE)),IF(OR(WEEKDAY(Y27)=1,WEEKDAY(Y27)=7),\"\",Erfassung!$B$2*SUM(Erfassung!$O2:$O2)/5),\"F\")","v":6.7200000000000006},{"$f":"IF(ISNA(VLOOKUP(Z27,'Feiertage und Ferien'!$A:$D,3,FALSE)),IF(OR(WEEKDAY(Z27)=1,WEEKDAY(Z27)=7),\"\",Erfassung!$B$2*SUM(Erfassung!$O2:$O2)/5),\"F\")","v":6.7200000000000006},{"$f":"IF(ISNA(VLOOKUP(AA27,'Feiertage und Ferien'!$A:$D,3,FALSE)),IF(OR(WEEKDAY(AA27)=1,WEEKDAY(AA27)=7),\"\",Erfassung!$B$2*SUM(Erfassung!$O2:$O2)/5),\"F\")","v":6.7200000000000006},{"$f":"IF(ISNA(VLOOKUP(AB27,'Feiertage und Ferien'!$A:$D,3,FALSE)),IF(OR(WEEKDAY(AB27)=1,WEEKDAY(AB27)=7),\"\",Erfassung!$B$2*SUM(Erfassung!$O2:$O2)/5),\"F\")","v":""},{"$f":"IF(ISNA(VLOOKUP(AC27,'Feiertage und Ferien'!$A:$D,3,FALSE)),IF(OR(WEEKDAY(AC27)=1,WEEKDAY(AC27)=7),\"\",Erfassung!$B$2*SUM(Erfassung!$O2:$O2)/5),\"F\")","v":""},{"$f":"IF(ISNA(VLOOKUP(AD27,'Feiertage und Ferien'!$A:$D,3,FALSE)),IF(OR(WEEKDAY(AD27)=1,WEEKDAY(AD27)=7),\"\",Erfassung!$B$2*SUM(Erfassung!$O2:$O2)/5),\"F\")","v":6.7200000000000006},{"$f":"IF(ISNA(VLOOKUP(AE27,'Feiertage und Ferien'!$A:$D,3,FALSE)),IF(OR(WEEKDAY(AE27)=1,WEEKDAY(AE27)=7),\"\",Erfassung!$B$2*SUM(Erfassung!$O2:$O2)/5),\"F\")","v":6.7200000000000006},{"$f":"IF(ISNA(VLOOKUP(AF27,'Feiertage und Ferien'!$A:$D,3,FALSE)),IF(OR(WEEKDAY(AF27)=1,WEEKDAY(AF27)=7),\"\",Erfassung!$B$2*SUM(Erfassung!$O2:$O2)/5),\"F\")","v":""},null,null,{"$f":"Erfassung!O2+20%","v":1},"September"]
[null,{"$f":"IF(B28=\"F\",B28,Arbeitstage!B21)","v":1},{"$f":"IF(C28=\"F\",C28,Arbeitstage!C21)","v":1},{"$f":"IF(D28=\"F\",D28,Arbeitstage!D21)","v":1},{"$f":"IF(E28=\"F\",E28,Arbeitstage!E21)","v":1},{"$f":"IF(F28=\"F\",F28,Arbeitstage!F21)","v":1},{"$f":"IF(G28=\"F\",G28,Arbeitstage!G21)","v":""},{"$f":"IF(H28=\"F\",H28,Arbeitstage!H21)","v":""},{"$f":"IF(I28=\"F\",I28,Arbeitstage!I21)","v":1},{"$f":"IF(J28=\"F\",J28,Arbeitstage!J21)","v":1},{"$f":"IF(K28=\"F\",K28,Arbeitstage!K21)","v":1},{"$f":"IF(L28=\"F\",L28,Arbeitstage!L21)","v":1},{"$f":"IF(M28=\"F\",M28,Arbeitstage!M21)","v":1},{"$f":"IF(N28=\"F\",N28,Arbeitstage!N21)","v":""},{"$f":"IF(O28=\"F\",O28,Arbeitstage!O21)","v":""},{"$f":"IF(P28=\"F\",P28,Arbeitstage!P21)","v":1},{"$f":"IF(Q28=\"F\",Q28,Arbeitstage!Q21)","v":1},{"$f":"IF(R28=\"F\",R28,Arbeitstage!R21)","v":1},{"$f":"IF(S28=\"F\",S28,Arbeitstage!S21)","v":1},{"$f":"IF(T28=\"F\",T28,Arbeitstage!T21)","v":1},{"$f":"IF(U28=\"F\",U28,Arbeitstage!U21)","v":""},{"$f":"IF(V28=\"F\",V28,Arbeitstage!V21)","v":""},{"$f":"IF(W28=\"F\",W28,Arbeitstage!W21)","v":1},{"$f":"IF(X28=\"F\",X28,Arbeitstage!X21)","v":1},{"$f":"IF(Y28=\"F\",Y28,Arbeitstage!Y21)","v":1},{"$f":"IF(Z28=\"F\",Z28,Arbeitstage!Z21)","v":1},{"$f":"IF(AA28=\"F\",AA28,Arbeitstage!AA21)","v":1},{"$f":"IF(AB28=\"F\",AB28,Arbeitstage!AB21)","v":"F"},{"$f":"IF(AC28=\"F\",AC28,Arbeitstage!AC21)","v":"F"},{"$f":"IF(AD28=\"F\",AD28,Arbeitstage!AD21)","v":"F"},{"$f":"IF(AE28=\"F\",AE28,Arbeitstage!AE21)","v":"F"},{"$f":"IF(AF28=\"F\",AF28,Arbeitstage!AF21)","v":""},{"$f":"SUM(Erfassung!$D:$D)/12","v":2.0833333333333335},{"$f":"IF(AG29=\"\",\"\",AG29*Erfassung!B2*SUM(Erfassung!O2:O2)/5)","v":14},{"$f":"SUM(B29:AF29)","v":20},{"$f":"SUM(B28:AF28)","v":147.84},{"$f":"ROUND(AI29*AI28/5,1)*5","v":20}]
[null,{"$f":"AE27+1","v":"2025-10-01"},{"$f":"B30+1","v":"2025-10-02"},"2025-10-03","2025-10-04","2025-10-05","2025-10-06","2025-10-07","2025-10-08","2025-10-09","2025-10-10","2025-10-11","2025-10-12","2025-10-13","2025-10-14","2025-10-15","2025-10-16","2025-10-17","2025-10-18","2025-10-19","2025-10-20","2025-10-21","2025-10-22","2025-10-23","2025-10-24","2025-10-25","2025-10-26","2025-10-27","2025-10-28","2025-10-29","2025-10-30","2025-10-31"]
["Oktober",{"$f":"IF(ISNA(VLOOKUP(B30,'Feiertage und Ferien'!$A:$D,3,FALSE)),IF(OR(WEEKDAY(B30)=1,WEEKDAY(B30)=7),\"\",Erfassung!$B$2*SUM(Erfassung!$P2:$P2)/5),\"F\")","v":6.7200000000000006},{"$f":"IF(ISNA(VLOOKUP(C30,'Feiertage und Ferien'!$A:$D,3,FALSE)),IF(OR(WEEKDAY(C30)=1,WEEKDAY(C30)=7),\"\",Erfassung!$B$2*SUM(Erfassung!$P2:$P2)/5),\"F\")","v":6.7200000000000006},{"$f":"IF(ISNA(VLOOKUP(D30,'Feiertage und Ferien'!$A:$D,3,FALSE)),IF(OR(WEEKDAY(D30)=1,WEEKDAY(D30)=7),\"\",Erfassung!$B$2*SUM(Erfassung!$P2:$P2)/5),\"F\")","v":6.7200000000000006},{"$f":"IF(ISNA(VLOOKUP(E30,'Feiertage und Ferien'!$A:$D,3,FALSE)),IF(OR(WEEKDAY(E30)=1,WEEKDAY(E30)=7),\"\",Erfassung!$B$2*SUM(Erfassung!$P2:$P2)/5),\"F\")","v":""},{"$f":"IF(ISNA(VLOOKUP(F30,'Feiertage und Ferien'!$A:$D,3,FALSE)),IF(OR(WEEKDAY(F30)=1,WEEKDAY(F30)=7),\"\",Erfassung!$B$2*SUM(Erfassung!$P2:$P2)/5),\"F\")","v":""},{"$f":"IF(ISNA(VLOOKUP(G30,'Feiertage und Ferien'!$A:$D,3,FALSE)),IF(OR(WEEKDAY(G30)=1,WEEKDAY(G30)=7),\"\",Erfassung!$B$2*SUM(Erfassung!$P2:$P2)/5),\"F\")","v":6.7200000000000006},{"$f":"IF(ISNA(VLOOKUP(H30,'Feiertage und Ferien'!$A:$D,3,FALSE)),IF(OR(WEEKDAY(H30)=1,WEEKDAY(H30)=7),\"\",Erfassung!$B$2*SUM(Erfassung!$P2:$P2)/5),\"F\")","v":6.7200000000000006},{"$f":"IF(ISNA(VLOOKUP(I30,'Feiertage und Ferien'!$A:$D,3,FALSE)),IF(OR(WEEKDAY(I30)=1,WEEKDAY(I30)=7),\"\",Erfassung!$B$2*SUM(Erfassung!$P2:$P2)/5),\"F\")","v":6.7200000000000006},{"$f":"IF(ISNA(VLOOKUP(J30,'Feiertage und Ferien'!$A:$D,3,FALSE)),IF(OR(WEEKDAY(J30)=1,WEEKDAY(J30)=7),\"\",Erfassung!$B$2*SUM(Erfassung!$P2:$P2)/5),\"F\")","v":6.7200000000000006},{"$f":"IF(ISNA(VLOOKUP(K30,'Feiertage und Ferien'!$A:$D,3,FALSE)),IF(OR(WEEKDAY(K30)=1,WEEKDAY(K30)=7),\"\",Erfassung!$B$2*SUM(Erfassung!$P2:$P2)/5),\"F\")","v":6.7200000000000006},{"$f":"IF(ISNA(VLOOKUP(L30,'Feiertage und Ferien'!$A:$D,3,FALSE)),IF(OR(WEEKDAY(L30)=1,WEEKDAY(L30)=7),\"\",Erfassung!$B$2*SUM(Erfassung!$P2:$P2)/5),\"F\")","v":""},{"$f":"IF(ISNA(VLOOKUP(M30,'Feiertage und Ferien'!$A:$D,3,FALSE)),IF(OR(WEEKDAY(M30)=1,WEEKDAY(M30)=7),\"\",Erfassung!$B$2*SUM(Erfassung!$P2:$P2)/5),\"F\")","v":""},{"$f":"IF(ISNA(VLOOKUP(N30,'Feiertage und Ferien'!$A:$D,3,FALSE)),IF(OR(WEEKDAY(N30)=1,WEEKDAY(N30)=7),\"\",Erfassung!$B$2*SUM(Erfassung!$P2:$P2)/5),\"F\")","v":6.7200000000000006},{"$f":"IF(ISNA(VLOOKUP(O30,'Feiertage und Ferien'!$A:$D,3,FALSE)),IF(OR(WEEKDAY(O30)=1,WEEKDAY(O30)=7),\"\",Erfassung!$B$2*SUM(Erfassung!$P2:$P2)/5),\"F\")","v":6.7200000000000006},{"$f":"IF(ISNA(VLOOKUP(P30,'Feiertage und Ferien'!$A:$D,3,FALSE)),IF(OR(WEEKDAY(P30)=1,WEEKDAY(P30)=7),\"\",Erfassung!$B$2*SUM(Erfassung!$P2:$P2)/5),\"F\")","v":6.7200000000000006},{"$f":"IF(ISNA(VLOOKUP(Q30,'Feiertage und Ferien'!$A:$D,3,FALSE)),IF(OR(WEEKDAY(Q30)=1,WEEKDAY(Q30)=7),\"\",Erfassung!$B$2*SUM(Erfassung!$P2:$P2)/5),\"F\")","v":6.7200000000000006},{"$f":"IF(ISNA(VLOOKUP(R30,'Feiertage und Ferien'!$A:$D,3,FALSE)),IF(OR(WEEKDAY(R30)=1,WEEKDAY(R30)=7),\"\",Erfassung!$B$2*SUM(Erfassung!$P2:$P2)/5),\"F\")","v":6.7200000000000006},{"$f":"IF(ISNA(VLOOKUP(S30,'Feiertage und Ferien'!$A:$D,3,FALSE)),IF(OR(WEEKDAY(S30)=1,WEEKDAY(S30)=7),\"\",Erfassung!$B$2*SUM(Erfassung!$P2:$P2)/5),\"F\")","v":""},{"$f":"IF(ISNA(VLOOKUP(T30,'Feiertage und Ferien'!$A:$D,3,FALSE)),IF(OR(WEEKDAY(T30)=1,WEEKDAY(T30)=7),\"\",Erfassung!$B$2*SUM(Erfassung!$P2:$P2)/5),\"F\")","v":""},{"$f":"IF(ISNA(VLOOKUP(U30,'Feiertage und Ferien'!$A:$D,3,FALSE)),IF(OR(WEEKDAY(U30)=1,WEEKDAY(U30)=7),\"\",Erfassung!$B$2*SUM(Erfassung!$P2:$P2)/5),\"F\")","v":6.7200000000000006},{"$f":"IF(ISNA(VLOOKUP(V30,'Feiertage und Ferien'!$A:$D,3,FALSE)),IF(OR(WEEKDAY(V30)=1,WEEKDAY(V30)=7),\"\",Erfassung!$B$2*SUM(Erfassung!$P2:$P2)/5),\"F\")","v":6.7200000000000006},{"$f":"IF(ISNA(VLOOKUP(W30,'Feiertage und Ferien'!$A:$D,3,FALSE)),IF(OR(WEEKDAY(W30)=1,WEEKDAY(W30)=7),\"\",Erfassung!$B$2*SUM(Erfassung!$P2:$P2)/5),\"F\")","v":6.7200000000000006},{"$f":"IF(ISNA(VLOOKUP(X30,'Feiertage und Ferien'!$A:$D,3,FALSE)),IF(OR(WEEKDAY(X30)=1,WEEKDAY(X30)=7),\"\",Erfassung!$B$2*SUM(Erfassung!$P2:$P2)/5),\"F\")","v":6.7200000000000006},{"$f":"IF(ISNA(VLOOKUP(Y30,'Feiertage und Ferien'!$A:$D,3,FALSE)),IF(OR(WEEKDAY(Y30)=1,WEEKDAY(Y30)=7),\"\",Erfassung!$B$2*SUM(Erfassung!$P2:$P2)/5),\"F\")","v":6.7200000000000006},{"$f":"IF(ISNA(VLOOKUP(Z30,'Feiertage und Ferien'!$A:$D,3,FALSE)),IF(OR(WEEKDAY(Z30)=1,WEEKDAY(Z30)=7),\"\",Erfassung!$B$2*SUM(Erfassung!$P2:$P2)/5),\"F\")","v":""},{"$f":"IF(ISNA(VLOOKUP(AA30,'Feiertage und Ferien'!$A:$D,3,FALSE)),IF(OR(WEEKDAY(AA30)=1,WEEKDAY(AA30)=7),\"\",Erfassung!$B$2*SUM(Erfassung!$P2:$P2)/5),\"F\")","v":""},{"$f":"IF(ISNA(VLOOKUP(AB30,'Feiertage und Ferien'!$A:$D,3,FALSE)),IF(OR(WEEKDAY(AB30)=1,WEEKDAY(AB30)=7),\"\",Erfassung!$B$2*SUM(Erfassung!$P2:$P2)/5),\"F\")","v":6.7200000000000006},{"$f":"IF(ISNA(VLOOKUP(AC30,'Feiertage und Ferien'!$A:$D,3,FALSE)),IF(OR(WEEKDAY(AC30)=1,WEEKDAY(AC30)=7),\"\",Erfassung!$B$2*SUM(Erfassung!$P2:$P2)/5),\"F\")","v":6.7200000000000006},{"$f":"IF(ISNA(VLOOKUP(AD30,'Feiertage und Ferien'!$A:$D,3,FALSE)),IF(OR(WEEKDAY(AD30)=1,WEEKDAY(AD30)=7),\"\",Erfassung!$B$2*SUM(Erfassung!$P2:$P2)/5),\"F\")","v":6.7200000000000006},{"$f":"IF(ISNA(VLOOKUP(AE30,'Feiertage und Ferien'!$A:$D,3,FALSE)),IF(OR(WEEKDAY(AE30)=1,WEEKDAY(AE30)=7),\"\",Erfassung!$B$2*SUM(Erfassung!$P2:$P2)/5),\"F\")","v":6.7200000000000006},{"$f":"IF(ISNA(VLOOKUP(AF30,'Feiertage und Ferien'!$A:$D,3,FALSE)),IF(OR(WEEKDAY(AF30)=1,WEEKDAY(AF30)=7),\"\",Erfassung!$B$2*SUM(Erfassung!$P2:$P2)/5),\"F\")","v":6.7200000000000006},null,null,{"$f":"Erfassung!P2+20%","v":1},"Oktober"]
[null,{"$f":"IF(B31=\"F\",B31,Arbeitstage!B23)","v":"F"},{"$f":"IF(C31=\"F\",C31,Arbeitstage!C23)","v":"F"},{"$f":"IF(D31=\"F\",D31,Arbeitstage!D23)","v":"F"},{"$f":"IF(E31=\"F\",E31,Arbeitstage!E23)","v":"F"},{"$f":"IF(F31=\"F\",F31,Arbeitstage!F23)","v":"F"},{"$f":"IF(G31=\"F\",G31,Arbeitstage!G23)","v":"F"},{"$f":"IF(H31=\"F\",H31,Arbeitstage!H23)","v":"F"},{"$f":"IF(I31=\"F\",I31,Arbeitstage!I23)","v":"F"},{"$f":"IF(J31=\"F\",J31,Arbeitstage!J23)","v":"F"},{"$f":"IF(K31=\"F\",K31,Arbeitstage!K23)","v":"F"},{"$f":"IF(L31=\"F\",L31,Arbeitstage!L23)","v":"F"},{"$f":"IF(M31=\"F\",M31,Arbeitstage!M23)","v":""},{"$f":"IF(N31=\"F\",N31,Arbeitstage!N23)","v":1},{"$f":"IF(O31=\"F\",O31,Arbeitstage!O23)","v":1},{"$f":"IF(P31=\"F\",P31,Arbeitstage!P23)","v":1},{"$f":"IF(Q31=\"F\",Q31,Arbeitstage!Q23)","v":1},{"$f":"IF(R31=\"F\",R31,Arbeitstage!R23)","v":1},{"$f":"IF(S31=\"F\",S31,Arbeitstage!S23)","v":""},{"$f":"IF(T31=\"F\",T31,Arbeitstage!T23)","v":""},{"$f":"IF(U31=\"F\",U31,Arbeitstage!U23)","v":1},{"$f":"IF(V31=\"F\",V31,Arbeitstage!V23)","v":1},{"$f":"IF(W31=\"F\",W31,Arbeitstage!W23)","v":1},{"$f":"IF(X31=\"F\",X31,Arbeitstage!X23)","v":1},{"$f":"IF(Y31=\"F\",Y31,Arbeitstage!Y23)","v":1},{"$f":"IF(Z31=\"F\",Z31,Arbeitstage!Z23)","v":""},{"$f":"IF(AA31=\"F\",AA31,Arbeitstage!AA23)","v":""},{"$f":"IF(AB31=\"F\",AB31,Arbeitstage!AB23)","v":1},{"$f":"IF(AC31=\"F\",AC31,Arbeitstage!AC23)","v":1},{"$f":"IF(AD31=\"F\",AD31,Arbeitstage!AD23)","v":1},{"$f":"IF(AE31=\"F\",AE31,Arbeitstage!AE23)","v":1},{"$f":"IF(AF31=\"F\",AF31,Arbeitstage!AF23)","v":1},{"$f":"SUM(Erfassung!$D:$D)/12","v":2.0833333333333335},{"$f":"IF(AG32=\"\",\"\",AG32*Erfassung!B2*SUM(Erfassung!P2:P2)/5)","v":14},{"$f":"SUM(B32:AF32)","v":15},{"$f":"SUM(B31:AF31)","v":154.56},{"$f":"ROUND(AI32*AI31/5,1)*5","v":15}]
[null,{"$f":"AF30+1","v":"2025-11-01"},{"$f":"B33+1","v":45963},45964,45965,45966,45967,45968,45969,45970,45971,45972,45973,45974,45975,45976,45977,45978,45979,45980,45981,45982,45983,45984,45985,45986,45987,45988,45989,45990,45991]
["November",{"$f":"IF(ISNA(VLOOKUP(B33,'Feiertage und Ferien'!$A:$D,3,FALSE)),IF(OR(WEEKDAY(B33)=1,WEEKDAY(B33)=7),\"\",Erfassung!$B$2*SUM(Erfassung!$Q2:$Q2)/5),\"F\")","v":""},{"$f":"IF(ISNA(VLOOKUP(C33,'Feiertage und Ferien'!$A:$D,3,FALSE)),IF(OR(WEEKDAY(C33)=1,WEEKDAY(C33)=7),\"\",Erfassung!$B$2*SUM(Erfassung!$Q2:$Q2)/5),\"F\")","v":""},{"$f":"IF(ISNA(VLOOKUP(D33,'Feiertage und Ferien'!$A:$D,3,FALSE)),IF(OR(WEEKDAY(D33)=1,WEEKDAY(D33)=7),\"\",Erfassung!$B$2*SUM(Erfassung!$Q2:$Q2)/5),\"F\")","v":6.7200000000000006},{"$f":"IF(ISNA(VLOOKUP(E33,'Feiertage und Ferien'!$A:$D,3,FALSE)),IF(OR(WEEKDAY(E33)=1,WEEKDAY(E33)=7),\"\",Erfassung!$B$2*SUM(Erfassung!$Q2:$Q2)/5),\"F\")","v":6.7200000000000006},{"$f":"IF(ISNA(VLOOKUP(F33,'Feiertage und Ferien'!$A:$D,3,FALSE)),IF(OR(WEEKDAY(F33)=1,WEEKDAY(F33)=7),\"\",Erfassung!$B$2*SUM(Erfassung!$Q2:$Q2)/5),\"F\")","v":6.7200000000000006},{"$f":"IF(ISNA(VLOOKUP(G33,'Feiertage und Ferien'!$A:$D,3,FALSE)),IF(OR(WEEKDAY(G33)=1,WEEKDAY(G33)=7),\"\",Erfassung!$B$2*SUM(Erfassung!$Q2:$Q2)/5),\"F\")","v":6.7200000000000006},{"$f":"IF(ISNA(VLOOKUP(H33,'Feiertage und Ferien'!$A:$D,3,FALSE)),IF(OR(WEEKDAY(H33)=1,WEEKDAY(H33)=7),\"\",Erfassung!$B$2*SUM(Erfassung!$Q2:$Q2)/5),\"F\")","v":6.7200000000000006},{"$f":"IF(ISNA(VLOOKUP(I33,'Feiertage und Ferien'!$A:$D,3,FALSE)),IF(OR(WEEKDAY(I33)=1,WEEKDAY(I33)=7),\"\",Erfassung!$B$2*SUM(Erfassung!$Q2:$Q2)/5),\"F\")","v":""},{"$f":"IF(ISNA(VLOOKUP(J33,'Feiertage und Ferien'!$A:$D,3,FALSE)),IF(OR(WEEKDAY(J33)=1,WEEKDAY(J33)=7),\"\",Erfassung!$B$2*SUM(Erfassung!$Q2:$Q2)/5),\"F\")","v":""},{"$f":"IF(ISNA(VLOOKUP(K33,'Feiertage und Ferien'!$A:$D,3,FALSE)),IF(OR(WEEKDAY(K33)=1,WEEKDAY(K33)=7),\"\",Erfassung!$B$2*SUM(Erfassung!$Q2:$Q2)/5),\"F\")","v":6.7200000000000006},{"$f":"IF(ISNA(VLOOKUP(L33,'Feiertage und Ferien'!$A:$D,3,FALSE)),IF(OR(WEEKDAY(L33)=1,WEEKDAY(L33)=7),\"\",Erfassung!$B$2*SUM(Erfassung!$Q2:$Q2)/5),\"F\")","v":6.7200000000000006},{"$f":"IF(ISNA(VLOOKUP(M33,'Feiertage und Ferien'!$A:$D,3,FALSE)),IF(OR(WEEKDAY(M33)=1,WEEKDAY(M33)=7),\"\",Erfassung!$B$2*SUM(Erfassung!$Q2:$Q2)/5),\"F\")","v":6.7200000000000006},{"$f":"IF(ISNA(VLOOKUP(N33,'Feiertage und Ferien'!$A:$D,3,FALSE)),IF(OR(WEEKDAY(N33)=1,WEEKDAY(N33)=7),\"\",Erfassung!$B$2*SUM(Erfassung!$Q2:$Q2)/5),\"F\")","v":6.7200000000000006},{"$f":"IF(ISNA(VLOOKUP(O33,'Feiertage und Ferien'!$A:$D,3,FALSE)),IF(OR(WEEKDAY(O33)=1,WEEKDAY(O33)=7),\"\",Erfassung!$B$2*SUM(Erfassung!$Q2:$Q2)/5),\"F\")","v":6.7200000000000006},{"$f":"IF(ISNA(VLOOKUP(P33,'Feiertage und Ferien'!$A:$D,3,FALSE)),IF(OR(WEEKDAY(P33)=1,WEEKDAY(P33)=7),\"\",Erfassung!$B$2*SUM(Erfassung!$Q2:$Q2)/5),\"F\")","v":""},{"$f":"IF(ISNA(VLOOKUP(Q33,'Feiertage und Ferien'!$A:$D,3,FALSE)),IF(OR(WEEKDAY(Q33)=1,WEEKDAY(Q33)=7),\"\",Erfassung!$B$2*SUM(Erfassung!$Q2:$Q2)/5),\"F\")","v":""},{"$f":"IF(ISNA(VLOOKUP(R33,'Feiertage und Ferien'!$A:$D,3,FALSE)),IF(OR(WEEKDAY(R33)=1,WEEKDAY(R33)=7),\"\",Erfassung!$B$2*SUM(Erfassung!$Q2:$Q2)/5),\"F\")","v":6.7200000000000006},{"$f":"IF(ISNA(VLOOKUP(S33,'Feiertage und Ferien'!$A:$D,3,FALSE)),IF(OR(WEEKDAY(S33)=1,WEEKDAY(S33)=7),\"\",Erfassung!$B$2*SUM(Erfassung!$Q2:$Q2)/5),\"F\")","v":6.7200000000000006},{"$f":"IF(ISNA(VLOOKUP(T33,'Feiertage und Ferien'!$A:$D,3,FALSE)),IF(OR(WEEKDAY(T33)=1,WEEKDAY(T33)=7),\"\",Erfassung!$B$2*SUM(Erfassung!$Q2:$Q2)/5),\"F\")","v":6.7200000000000006},{"$f":"IF(ISNA(VLOOKUP(U33,'Feiertage und Ferien'!$A:$D,3,FALSE)),IF(OR(WEEKDAY(U33)=1,WEEKDAY(U33)=7),\"\",Erfassung!$B$2*SUM(Erfassung!$Q2:$Q2)/5),\"F\")","v":6.7200000000000006},{"$f":"IF(ISNA(VLOOKUP(V33,'Feiertage und Ferien'!$A:$D,3,FALSE)),IF(OR(WEEKDAY(V33)=1,WEEKDAY(V33)=7),\"\",Erfassung!$B$2*SUM(Erfassung!$Q2:$Q2)/5),\"F\")","v":6.7200000000000006},{"$f":"IF(ISNA(VLOOKUP(W33,'Feiertage und Ferien'!$A:$D,3,FALSE)),IF(OR(WEEKDAY(W33)=1,WEEKDAY(W33)=7),\"\",Erfassung!$B$2*SUM(Erfassung!$Q2:$Q2)/5),\"F\")","v":""},{"$f":"IF(ISNA(VLOOKUP(X33,'Feiertage und Ferien'!$A:$D,3,FALSE)),IF(OR(WEEKDAY(X33)=1,WEEKDAY(X33)=7),\"\",Erfassung!$B$2*SUM(Erfassung!$Q2:$Q2)/5),\"F\")","v":""},{"$f":"IF(ISNA(VLOOKUP(Y33,'Feiertage und Ferien'!$A:$D,3,FALSE)),IF(OR(WEEKDAY(Y33)=1,WEEKDAY(Y33)=7),\"\",Erfassung!$B$2*SUM(Erfassung!$Q2:$Q2)/5),\"F\")","v":6.7200000000000006},{"$f":"IF(ISNA(VLOOKUP(Z33,'Feiertage und Ferien'!$A:$D,3,FALSE)),IF(OR(WEEKDAY(Z33)=1,WEEKDAY(Z33)=7),\"\",Erfassung!$B$2*SUM(Erfassung!$Q2:$Q2)/5),\"F\")","v":6.7200000000000006},{"$f":"IF(ISNA(VLOOKUP(AA33,'Feiertage und Ferien'!$A:$D,3,FALSE)),IF(OR(WEEKDAY(AA33)=1,WEEKDAY(AA33)=7),\"\",Erfassung!$B$2*SUM(Erfassung!$Q2:$Q2)/5),\"F\")","v":6.7200000000000006},{"$f":"IF(ISNA(VLOOKUP(AB33,'Feiertage und Ferien'!$A:$D,3,FALSE)),IF(OR(WEEKDAY(AB33)=1,WEEKDAY(AB33)=7),\"\",Erfassung!$B$2*SUM(Erfassung!$Q2:$Q2)/5),\"F\")","v":6.7200000000000006},{"$f":"IF(ISNA(VLOOKUP(AC33,'Feiertage und Ferien'!$A:$D,3,FALSE)),IF(OR(WEEKDAY(AC33)=1,WEEKDAY(AC33)=7),\"\",Erfassung!$B$2*SUM(Erfassung!$Q2:$Q2)/5),\"F\")","v":6.7200000000000006},{"$f":"IF(ISNA(VLOOKUP(AD33,'Feiertage und Ferien'!$A:$D,3,FALSE)),IF(OR(WEEKDAY(AD33)=1,WEEKDAY(AD33)=7),\"\",Erfassung!$B$2*SUM(Erfassung!$Q2:$Q2)/5),\"F\")","v":""},{"$f":"IF(ISNA(VLOOKUP(AE33,'Feiertage und Ferien'!$A:$D,3,FALSE)),IF(OR(WEEKDAY(AE33)=1,WEEKDAY(AE33)=7),\"\",Erfassung!$B$2*SUM(Erfassung!$Q2:$Q2)/5),\"F\")","v":""},{"$f":"IF(ISNA(VLOOKUP(AF33,'Feiertage und Ferien'!$A:$D,3,FALSE)),IF(OR(WEEKDAY(AF33)=1,WEEKDAY(AF33)=7),\"\",Erfassung!$B$2*SUM(Erfassung!$Q2:$Q2)/5),\"F\")","v":""},null,null,{"$f":"Erfassung!Q2+20%","v":1},"November"]
[null,{"$f":"IF(B34=\"F\",B34,Arbeitstage!B25)","v":""},{"$f":"IF(C34=\"F\",C34,Arbeitstage!C25)","v":""},{"$f":"IF(D34=\"F\",D34,Arbeitstage!D25)","v":1},{"$f":"IF(E34=\"F\",E34,Arbeitstage!E25)","v":1},{"$f":"IF(F34=\"F\",F34,Arbeitstage!F25)","v":1},{"$f":"IF(G34=\"F\",G34,Arbeitstage!G25)","v":1},{"$f":"IF(H34=\"F\",H34,Arbeitstage!H25)","v":1},{"$f":"IF(I34=\"F\",I34,Arbeitstage!I25)","v":""},{"$f":"IF(J34=\"F\",J34,Arbeitstage!J25)","v":""},{"$f":"IF(K34=\"F\",K34,Arbeitstage!K25)","v":1},{"$f":"IF(L34=\"F\",L34,Arbeitstage!L25)","v":1},{"$f":"IF(M34=\"F\",M34,Arbeitstage!M25)","v":1},{"$f":"IF(N34=\"F\",N34,Arbeitstage!N25)","v":1},{"$f":"IF(O34=\"F\",O34,Arbeitstage!O25)","v":1},{"$f":"IF(P34=\"F\",P34,Arbeitstage!P25)","v":""},{"$f":"IF(Q34=\"F\",Q34,Arbeitstage!Q25)","v":""},{"$f":"IF(R34=\"F\",R34,Arbeitstage!R25)","v":1},{"$f":"IF(S34=\"F\",S34,Arbeitstage!S25)","v":1},{"$f":"IF(T34=\"F\",T34,Arbeitstage!T25)","v":1},{"$f":"IF(U34=\"F\",U34,Arbeitstage!U25)","v":1},{"$f":"IF(V34=\"F\",V34,Arbeitstage!V25)","v":1},{"$f":"IF(W34=\"F\",W34,Arbeitstage!W25)","v":""},{"$f":"IF(X34=\"F\",X34,Arbeitstage!X25)","v":""},{"$f":"IF(Y34=\"F\",Y34,Arbeitstage!Y25)","v":1},{"$f":"IF(Z34=\"F\",Z34,Arbeitstage!Z25)","v":1},{"$f":"IF(AA34=\"F\",AA34,Arbeitstage!AA25)","v":1},{"$f":"IF(AB34=\"F\",AB34,Arbeitstage!AB25)","v":1},{"$f":"IF(AC34=\"F\",AC34,Arbeitstage!AC25)","v":1},{"$f":"IF(AD34=\"F\",AD34,Arbeitstage!AD25)","v":""},{"$f":"IF(AE34=\"F\",AE34,Arbeitstage!AE25)","v":""},{"$f":"IF(AF34=\"F\",AF34,Arbeitstage!AF25)","v":""},{"$f":"SUM(Erfassung!$D:$D)/12","v":2.0833333333333335},{"$f":"IF(AG35=\"\",\"\",AG35*Erfassung!B2*SUM(Erfassung!Q2:Q2)/5)","v":14},{"$f":"SUM(B35:AF35)","v":20},{"$f":"SUM(B34:AF34)","v":134.4},{"$f":"ROUND(AI35*AI34/5,1)*5","v":20}]
[null,{"$f":"AE33+1","v":"2025-12-01"},{"$f":"B36+1","v":45993},45994,45995,45996,45997,45998,45999,46000,46001,46002,46003,46004,46005,46006,46007,46008,46009,46010,46011,46012,46013,46014,46015,46016,46017,46018,46019,46020,46021,46022,null,{"$f":"IF(AG36=\"\",\"\",AG36*Erfassung!#REF!*SUM(Erfassung!Q:Q)/5)","v":""}]
["Dezember",{"$f":"IF(ISNA(VLOOKUP(B36,'Feiertage und Ferien'!$A:$D,3,FALSE)),IF(OR(WEEKDAY(B36)=1,WEEKDAY(B36)=7),\"\",Erfassung!$B$2*SUM(Erfassung!$R2:$R2)/5),\"F\")","v":6.7200000000000006},{"$f":"IF(ISNA(VLOOKUP(C36,'Feiertage und Ferien'!$A:$D,3,FALSE)),IF(OR(WEEKDAY(C36)=1,WEEKDAY(C36)=7),\"\",Erfassung!$B$2*SUM(Erfassung!$R2:$R2)/5),\"F\")","v":6.7200000000000006},{"$f":"IF(ISNA(VLOOKUP(D36,'Feiertage und Ferien'!$A:$D,3,FALSE)),IF(OR(WEEKDAY(D36)=1,WEEKDAY(D36)=7),\"\",Erfassung!$B$2*SUM(Erfassung!$R2:$R2)/5),\"F\")","v":6.7200000000000006},{"$f":"IF(ISNA(VLOOKUP(E36,'Feiertage und Ferien'!$A:$D,3,FALSE)),IF(OR(WEEKDAY(E36)=1,WEEKDAY(E36)=7),\"\",Erfassung!$B$2*SUM(Erfassung!$R2:$R2)/5),\"F\")","v":6.7200000000000006},{"$f":"IF(ISNA(VLOOKUP(F36,'Feiertage und Ferien'!$A:$D,3,FALSE)),IF(OR(WEEKDAY(F36)=1,WEEKDAY(F36)=7),\"\",Erfassung!$B$2*SUM(Erfassung!$R2:$R2)/5),\"F\")","v":6.7200000000000006},{"$f":"IF(ISNA(VLOOKUP(G36,'Feiertage und Ferien'!$A:$D,3,FALSE)),IF(OR(WEEKDAY(G36)=1,WEEKDAY(G36)=7),\"\",Erfassung!$B$2*SUM(Erfassung!$R2:$R2)/5),\"F\")","v":""},{"$f":"IF(ISNA(VLOOKUP(H36,'Feiertage und Ferien'!$A:$D,3,FALSE)),IF(OR(WEEKDAY(H36)=1,WEEKDAY(H36)=7),\"\",Erfassung!$B$2*SUM(Erfassung!$R2:$R2)/5),\"F\")","v":""},{"$f":"IF(ISNA(VLOOKUP(I36,'Feiertage und Ferien'!$A:$D,3,FALSE)),IF(OR(WEEKDAY(I36)=1,WEEKDAY(I36)=7),\"\",Erfassung!$B$2*SUM(Erfassung!$R2:$R2)/5),\"F\")","v":6.7200000000000006},{"$f":"IF(ISNA(VLOOKUP(J36,'Feiertage und Ferien'!$A:$D,3,FALSE)),IF(OR(WEEKDAY(J36)=1,WEEKDAY(J36)=7),\"\",Erfassung!$B$2*SUM(Erfassung!$R2:$R2)/5),\"F\")","v":6.7200000000000006},{"$f":"IF(ISNA(VLOOKUP(K36,'Feiertage und Ferien'!$A:$D,3,FALSE)),IF(OR(WEEKDAY(K36)=1,WEEKDAY(K36)=7),\"\",Erfassung!$B$2*SUM(Erfassung!$R2:$R2)/5),\"F\")","v":6.7200000000000006},{"$f":"IF(ISNA(VLOOKUP(L36,'Feiertage und Ferien'!$A:$D,3,FALSE)),IF(OR(WEEKDAY(L36)=1,WEEKDAY(L36)=7),\"\",Erfassung!$B$2*SUM(Erfassung!$R2:$R2)/5),\"F\")","v":6.7200000000000006},{"$f":"IF(ISNA(VLOOKUP(M36,'Feiertage und Ferien'!$A:$D,3,FALSE)),IF(OR(WEEKDAY(M36)=1,WEEKDAY(M36)=7),\"\",Erfassung!$B$2*SUM(Erfassung!$R2:$R2)/5),\"F\")","v":6.7200000000000006},{"$f":"IF(ISNA(VLOOKUP(N36,'Feiertage und Ferien'!$A:$D,3,FALSE)),IF(OR(WEEKDAY(N36)=1,WEEKDAY(N36)=7),\"\",Erfassung!$B$2*SUM(Erfassung!$R2:$R2)/5),\"F\")","v":""},{"$f":"IF(ISNA(VLOOKUP(O36,'Feiertage und Ferien'!$A:$D,3,FALSE)),IF(OR(WEEKDAY(O36)=1,WEEKDAY(O36)=7),\"\",Erfassung!$B$2*SUM(Erfassung!$R2:$R2)/5),\"F\")","v":""},{"$f":"IF(ISNA(VLOOKUP(P36,'Feiertage und Ferien'!$A:$D,3,FALSE)),IF(OR(WEEKDAY(P36)=1,WEEKDAY(P36)=7),\"\",Erfassung!$B$2*SUM(Erfassung!$R2:$R2)/5),\"F\")","v":6.7200000000000006},{"$f":"IF(ISNA(VLOOKUP(Q36,'Feiertage und Ferien'!$A:$D,3,FALSE)),IF(OR(WEEKDAY(Q36)=1,WEEKDAY(Q36)=7),\"\",Erfassung!$B$2*SUM(Erfassung!$R2:$R2)/5),\"F\")","v":6.7200000000000006},{"$f":"IF(ISNA(VLOOKUP(R36,'Feiertage und Ferien'!$A:$D,3,FALSE)),IF(OR(WEEKDAY(R36)=1,WEEKDAY(R36)=7),\"\",Erfassung!$B$2*SUM(Erfassung!$R2:$R2)/5),\"F\")","v":6.7200000000000006},{"$f":"IF(ISNA(VLOOKUP(S36,'Feiertage und Ferien'!$A:$D,3,FALSE)),IF(OR(WEEKDAY(S36)=1,WEEKDAY(S36)=7),\"\",Erfassung!$B$2*SUM(Erfassung!$R2:$R2)/5),\"F\")","v":6.7200000000000006},{"$f":"IF(ISNA(VLOOKUP(T36,'Feiertage und Ferien'!$A:$D,3,FALSE)),IF(OR(WEEKDAY(T36)=1,WEEKDAY(T36)=7),\"\",Erfassung!$B$2*SUM(Erfassung!$R2:$R2)/5),\"F\")","v":6.7200000000000006},{"$f":"IF(ISNA(VLOOKUP(U36,'Feiertage und Ferien'!$A:$D,3,FALSE)),IF(OR(WEEKDAY(U36)=1,WEEKDAY(U36)=7),\"\",Erfassung!$B$2*SUM(Erfassung!$R2:$R2)/5),\"F\")","v":""},{"$f":"IF(ISNA(VLOOKUP(V36,'Feiertage und Ferien'!$A:$D,3,FALSE)),IF(OR(WEEKDAY(V36)=1,WEEKDAY(V36)=7),\"\",Erfassung!$B$2*SUM(Erfassung!$R2:$R2)/5),\"F\")","v":""},{"$f":"IF(ISNA(VLOOKUP(W36,'Feiertage und Ferien'!$A:$D,3,FALSE)),IF(OR(WEEKDAY(W36)=1,WEEKDAY(W36)=7),\"\",Erfassung!$B$2*SUM(Erfassung!$R2:$R2)/5),\"F\")","v":6.7200000000000006},{"$f":"IF(ISNA(VLOOKUP(X36,'Feiertage und Ferien'!$A:$D,3,FALSE)),IF(OR(WEEKDAY(X36)=1,WEEKDAY(X36)=7),\"\",Erfassung!$B$2*SUM(Erfassung!$R2:$R2)/5),\"F\")","v":6.7200000000000006},{"$f":"IF(ISNA(VLOOKUP(Y36,'Feiertage und Ferien'!$A:$D,3,FALSE)),IF(OR(WEEKDAY(Y36)=1,WEEKDAY(Y36)=7),\"\",Erfassung!$B$2*SUM(Erfassung!$R2:$R2)/5),\"F\")","v":6.7200000000000006},{"$f":"IF(ISNA(VLOOKUP(Z36,'Feiertage und Ferien'!$A:$D,3,FALSE)),IF(OR(WEEKDAY(Z36)=1,WEEKDAY(Z36)=7),\"\",Erfassung!$B$2*SUM(Erfassung!$R2:$R2)/5),\"F\")","v":"F"},{"$f":"IF(ISNA(VLOOKUP(AA36,'Feiertage und Ferien'!$A:$D,3,FALSE)),IF(OR(WEEKDAY(AA36)=1,WEEKDAY(AA36)=7),\"\",Erfassung!$B$2*SUM(Erfassung!$R2:$R2)/5),\"F\")","v":"F"},{"$f":"IF(ISNA(VLOOKUP(AB36,'Feiertage und Ferien'!$A:$D,3,FALSE)),IF(OR(WEEKDAY(AB36)=1,WEEKDAY(AB36)=7),\"\",Erfassung!$B$2*SUM(Erfassung!$R2:$R2)/5),\"F\")","v":""},{"$f":"IF(ISNA(VLOOKUP(AC36,'Feiertage und Ferien'!$A:$D,3,FALSE)),IF(OR(WEEKDAY(AC36)=1,WEEKDAY(AC36)=7),\"\",Erfassung!$B$2*SUM(Erfassung!$R2:$R2)/5),\"F\")","v":""},{"$f":"IF(ISNA(VLOOKUP(AD36,'Feiertage und Ferien'!$A:$D,3,FALSE)),IF(OR(WEEKDAY(AD36)=1,WEEKDAY(AD36)=7),\"\",Erfassung!$B$2*SUM(Erfassung!$R2:$R2)/5),\"F\")","v":6.7200000000000006},{"$f":"IF(ISNA(VLOOKUP(AE36,'Feiertage und Ferien'!$A:$D,3,FALSE)),IF(OR(WEEKDAY(AE36)=1,WEEKDAY(AE36)=7),\"\",Erfassung!$B$2*SUM(Erfassung!$R2:$R2)/5),\"F\")","v":6.7200000000000006},{"$f":"IF(ISNA(VLOOKUP(AF36,'Feiertage und Ferien'!$A:$D,3,FALSE)),IF(OR(WEEKDAY(AF36)=1,WEEKDAY(AF36)=7),\"\",Erfassung!$B$2*SUM(Erfassung!$R2:$R2)/5),\"F\")","v":6.7200000000000006},null,null,{"$f":"Erfassung!R2+20%","v":1},"Dezember"]
[null,{"$f":"IF(B37=\"F\",B37,Arbeitstage!B27)","v":1},{"$f":"IF(C37=\"F\",C37,Arbeitstage!C27)","v":1},{"$f":"IF(D37=\"F\",D37,Arbeitstage!D27)","v":1},{"$f":"IF(E37=\"F\",E37,Arbeitstage!E27)","v":1},{"$f":"IF(F37=\"F\",F37,Arbeitstage!F27)","v":1},{"$f":"IF(G37=\"F\",G37,Arbeitstage!G27)","v":""},{"$f":"IF(H37=\"F\",H37,Arbeitstage!H27)","v":""},{"$f":"IF(I37=\"F\",I37,Arbeitstage!I27)","v":1},{"$f":"IF(J37=\"F\",J37,Arbeitstage!J27)","v":1},{"$f":"IF(K37=\"F\",K37,Arbeitstage!K27)","v":1},{"$f":"IF(L37=\"F\",L37,Arbeitstage!L27)","v":1},{"$f":"IF(M37=\"F\",M37,Arbeitstage!M27)","v":1},{"$f":"IF(N37=\"F\",N37,Arbeitstage!N27)","v":""},{"$f":"IF(O37=\"F\",O37,Arbeitstage!O27)","v":""},{"$f":"IF(P37=\"F\",P37,Arbeitstage!P27)","v":1},{"$f":"IF(Q37=\"F\",Q37,Arbeitstage!Q27)","v":1},{"$f":"IF(R37=\"F\",R37,Arbeitstage!R27)","v":1},{"$f":"IF(S37=\"F\",S37,Arbeitstage!S27)","v":1},{"$f":"IF(T37=\"F\",T37,Arbeitstage!T27)","v":1},{"$f":"IF(U37=\"F\",U37,Arbeitstage!U27)","v":"F"},{"$f":"IF(V37=\"F\",V37,Arbeitstage!V27)","v":"F"},{"$f":"IF(W37=\"F\",W37,Arbeitstage!W27)","v":"F"},{"$f":"IF(X37=\"F\",X37,Arbeitstage!X27)","v":"F"},{"$f":"IF(Y37=\"F\",Y37,Arbeitstage!Y27)","v":"F"},{"$f":"IF(Z37=\"F\",Z37,Arbeitstage!Z27)","v":"F"},{"$f":"IF(AA37=\"F\",AA37,Arbeitstage!AA27)","v":"F"},{"$f":"IF(AB37=\"F\",AB37,Arbeitstage!AB27)","v":"F"},{"$f":"IF(AC37=\"F\",AC37,Arbeitstage!AC27)","v":"F"},{"$f":"IF(AD37=\"F\",AD37,Arbeitstage!AD27)","v":"F"},{"$f":"IF(AE37=\"F\",AE37,Arbeitstage!AE27)","v":"F"},{"$f":"IF(AF37=\"F\",AF37,Arbeitstage!AF27)","v":"F"},{"$f":"SUM(Erfassung!$D:$D)/12","v":2.0833333333333335},{"$f":"IF(AG38=\"\",\"\",AG38*Erfassung!B2*SUM(Erfassung!R2:R2)/5)","v":14},{"$f":"SUM(B38:AF38)","v":15},{"$f":"SUM(B37:AF37)","v":141.12},{"$f":"ROUND(AI38*AI37/5,1)*5","v":15}]
[]
["Legende:","F","Feiertage (obere Zeile)",null,null,null,null,null,"Arbeitstage",null,null,null,"Wochenende oder Kalenderende"]
[null,"F","Ferien (untere Zeile)",null,null,null,null,null,null,null,null,null,null,null,null,null,null,null,null,null,null,null,null,null,null,null,null,null,null,null,null,null,null,null,null,"Total Schul-Arbeitstage:",{"$f":"SUM(AK5,AK8,AK11,AK14,AK17,AK20,AK23,AK26,AK29,AK32,AK35,AK38)","v":191}]
[]
[null,null,null,null,null,null,null,null,null,null,null,null,null,null,null,null,null,null,null,null,null,null,null,null,null,null,null,null,null,null,null,null,null,null,null,"Ferien",{"$f":"SUM(AH38,AH35,AH32,AH29,AH26,AH23,AH20,AH17,AH14,AH11,AH8,AH5)","v":168}]
[null,null,null,null,null,null,null,null,null,null,null,null,null,null,null,null,null,null,null,null,null,null,null,null,null,null,null,null,null,null,null,null,null,null,null,"Jahresarbeitszeit:",{"$f":"SUM(AJ5,AJ8,AJ11,AJ14,AJ17,AJ20,AJ23,AJ26,AJ29,AJ32,AJ35,AJ38)","v":1693.44}]

{"sheet":"Arbeitstage","index":3,"n_rows":33,"n_cols":36,"rows_kept":33,"cut":false,"hidden":true,"merged":[]}
["Arbeitszeiten"]
[]
[2025,1,2,3,4,5,6,7,8,9,10,11,12,13,14,15,16,17,18,19,20,21,22,23,24,25,26,27,28,29,30,31,1,"Mt.","%","Arbeitstage"]
[null,"2025-01-01",{"$f":"B4+1","v":"2025-01-02"},{"$f":"C4+1","v":"2025-01-03"},"2025-01-04","2025-01-05","2025-01-06","2025-01-07","2025-01-08","2025-01-09","2025-01-10","2025-01-11","2025-01-12","2025-01-13","2025-01-14","2025-01-15","2025-01-16","2025-01-17","2025-01-18","2025-01-19","2025-01-20","2025-01-21","2025-01-22","2025-01-23","2025-01-24","2025-01-25","2025-01-26","2025-01-27","2025-01-28","2025-01-29","2025-01-30","2025-01-31"]
["Januar",{"$f":"IF(SUMPRODUCT(('Feiertage und Ferien'!$H$8:$H$13<=B4)*('Feiertage und Ferien'!$I$8:$I$13>=B4)),\"F\",IF(OR(WEEKDAY(B4)=1,WEEKDAY(B4)=7),\"\",1))","v":"F"},{"$f":"IF(SUMPRODUCT(('Feiertage und Ferien'!$H$8:$H$13<=C4)*('Feiertage und Ferien'!$I$8:$I$13>=C4)),\"F\",IF(OR(WEEKDAY(C4)=1,WEEKDAY(C4)=7),\"\",1))","v":"F"},{"$f":"IF(SUMPRODUCT(('Feiertage und Ferien'!$H$8:$H$13<=D4)*('Feiertage und Ferien'!$I$8:$I$13>=D4)),\"F\",IF(OR(WEEKDAY(D4)=1,WEEKDAY(D4)=7),\"\",1))","v":"F"},{"$f":"IF(SUMPRODUCT(('Feiertage und Ferien'!$H$8:$H$13<=E4)*('Feiertage und Ferien'!$I$8:$I$13>=E4)),\"F\",IF(OR(WEEKDAY(E4)=1,WEEKDAY(E4)=7),\"\",1))","v":"F"},{"$f":"IF(SUMPRODUCT(('Feiertage und Ferien'!$H$8:$H$13<=F4)*('Feiertage und Ferien'!$I$8:$I$13>=F4)),\"F\",IF(OR(WEEKDAY(F4)=1,WEEKDAY(F4)=7),\"\",1))","v":"F"},{"$f":"IF(SUMPRODUCT(('Feiertage und Ferien'!$H$8:$H$13<=G4)*('Feiertage und Ferien'!$I$8:$I$13>=G4)),\"F\",IF(OR(WEEKDAY(G4)=1,WEEKDAY(G4)=7),\"\",1))","v":1},{"$f":"IF(SUMPRODUCT(('Feiertage und Ferien'!$H$8:$H$13<=H4)*('Feiertage und Ferien'!$I$8:$I$13>=H4)),\"F\",IF(OR(WEEKDAY(H4)=1,WEEKDAY(H4)=7),\"\",1))","v":1},{"$f":"IF(SUMPRODUCT(('Feiertage und Ferien'!$H$8:$H$13<=I4)*('Feiertage und Ferien'!$I$8:$I$13>=I4)),\"F\",IF(OR(WEEKDAY(I4)=1,WEEKDAY(I4)=7),\"\",1))","v":1},{"$f":"IF(SUMPRODUCT(('Feiertage und Ferien'!$H$8:$H$13<=J4)*('Feiertage und Ferien'!$I$8:$I$13>=J4)),\"F\",IF(OR(WEEKDAY(J4)=1,WEEKDAY(J4)=7),\"\",1))","v":1},{"$f":"IF(SUMPRODUCT(('Feiertage und Ferien'!$H$8:$H$13<=K4)*('Feiertage und Ferien'!$I$8:$I$13>=K4)),\"F\",IF(OR(WEEKDAY(K4)=1,WEEKDAY(K4)=7),\"\",1))","v":1},{"$f":"IF(SUMPRODUCT(('Feiertage und Ferien'!$H$8:$H$13<=L4)*('Feiertage und Ferien'!$I$8:$I$13>=L4)),\"F\",IF(OR(WEEKDAY(L4)=1,WEEKDAY(L4)=7),\"\",1))","v":""},{"$f":"IF(SUMPRODUCT(('Feiertage und Ferien'!$H$8:$H$13<=M4)*('Feiertage und Ferien'!$I$8:$I$13>=M4)),\"F\",IF(OR(WEEKDAY(M4)=1,WEEKDAY(M4)=7),\"\",1))","v":""},{"$f":"IF(SUMPRODUCT(('Feiertage und Ferien'!$H$8:$H$13<=N4)*('Feiertage und Ferien'!$I$8:$I$13>=N4)),\"F\",IF(OR(WEEKDAY(N4)=1,WEEKDAY(N4)=7),\"\",1))","v":1},{"$f":"IF(SUMPRODUCT(('Feiertage und Ferien'!$H$8:$H$13<=O4)*('Feiertage und Ferien'!$I$8:$I$13>=O4)),\"F\",IF(OR(WEEKDAY(O4)=1,WEEKDAY(O4)=7),\"\",1))","v":1},{"$f":"IF(SUMPRODUCT(('Feiertage und Ferien'!$H$8:$H$13<=P4)*('Feiertage und Ferien'!$I$8:$I$13>=P4)),\"F\",IF(OR(WEEKDAY(P4)=1,WEEKDAY(P4)=7),\"\",1))","v":1},{"$f":"IF(SUMPRODUCT(('Feiertage und Ferien'!$H$8:$H$13<=Q4)*('Feiertage und Ferien'!$I$8:$I$13>=Q4)),\"F\",IF(OR(WEEKDAY(Q4)=1,WEEKDAY(Q4)=7),\"\",1))","v":1},{"$f":"IF(SUMPRODUCT(('Feiertage und Ferien'!$H$8:$H$13<=R4)*('Feiertage und Ferien'!$I$8:$I$13>=R4)),\"F\",IF(OR(WEEKDAY(R4)=1,WEEKDAY(R4)=7),\"\",1))","v":1},{"$f":"IF(SUMPRODUCT(('Feiertage und Ferien'!$H$8:$H$13<=S4)*('Feiertage und Ferien'!$I$8:$I$13>=S4)),\"F\",IF(OR(WEEKDAY(S4)=1,WEEKDAY(S4)=7),\"\",1))","v":""},{"$f":"IF(SUMPRODUCT(('Feiertage und Ferien'!$H$8:$H$13<=T4)*('Feiertage und Ferien'!$I$8:$I$13>=T4)),\"F\",IF(OR(WEEKDAY(T4)=1,WEEKDAY(T4)=7),\"\",1))","v":""},{"$f":"IF(SUMPRODUCT(('Feiertage und Ferien'!$H$8:$H$13<=U4)*('Feiertage und Ferien'!$I$8:$I$13>=U4)),\"F\",IF(OR(WEEKDAY(U4)=1,WEEKDAY(U4)=7),\"\",1))","v":1},{"$f":"IF(SUMPRODUCT(('Feiertage und Ferien'!$H$8:$H$13<=V4)*('Feiertage und Ferien'!$I$8:$I$13>=V4)),\"F\",IF(OR(WEEKDAY(V4)=1,WEEKDAY(V4)=7),\"\",1))","v":1},{"$f":"IF(SUMPRODUCT(('Feiertage und Ferien'!$H$8:$H$13<=W4)*('Feiertage und Ferien'!$I$8:$I$13>=W4)),\"F\",IF(OR(WEEKDAY(W4)=1,WEEKDAY(W4)=7),\"\",1))","v":1},{"$f":"IF(SUMPRODUCT(('Feiertage und Ferien'!$H$8:$H$13<=X4)*('Feiertage und Ferien'!$I$8:$I$13>=X4)),\"F\",IF(OR(WEEKDAY(X4)=1,WEEKDAY(X4)=7),\"\",1))","v":1},{"$f":"IF(SUMPRODUCT(('Feiertage und Ferien'!$H$8:$H$13<=Y4)*('Feiertage und Ferien'!$I$8:$I$13>=Y4)),\"F\",IF(OR(WEEKDAY(Y4)=1,WEEKDAY(Y4)=7),\"\",1))","v":1},{"$f":"IF(SUMPRODUCT(('Feiertage und Ferien'!$H$8:$H$13<=Z4)*('Feiertage und Ferien'!$I$8:$I$13>=Z4)),\"F\",IF(OR(WEEKDAY(Z4)=1,WEEKDAY(Z4)=7),\"\",1))","v":"F"},{"$f":"IF(SUMPRODUCT(('Feiertage und Ferien'!$H$8:$H$13<=AA4)*('Feiertage und Ferien'!$I$8:$I$13>=AA4)),\"F\",IF(OR(WEEKDAY(AA4)=1,WEEKDAY(AA4)=7),\"\",1))","v":"F"},{"$f":"IF(SUMPRODUCT(('Feiertage und Ferien'!$H$8:$H$13<=AB4)*('Feiertage und Ferien'!$I$8:$I$13>=AB4)),\"F\",IF(OR(WEEKDAY(AB4)=1,WEEKDAY(AB4)=7),\"\",1))","v":"F"},{"$f":"IF(SUMPRODUCT(('Feiertage und Ferien'!$H$8:$H$13<=AC4)*('Feiertage und Ferien'!$I$8:$I$13>=AC4)),\"F\",IF(OR(WEEKDAY(AC4)=1,WEEKDAY(AC4)=7),\"\",1))","v":"F"},{"$f":"IF(SUMPRODUCT(('Feiertage und Ferien'!$H$8:$H$13<=AD4)*('Feiertage und Ferien'!$I$8:$I$13>=AD4)),\"F\",IF(OR(WEEKDAY(AD4)=1,WEEKDAY(AD4)=7),\"\",1))","v":"F"},{"$f":"IF(SUMPRODUCT(('Feiertage und Ferien'!$H$8:$H$13<=AE4)*('Feiertage und Ferien'!$I$8:$I$13>=AE4)),\"F\",IF(OR(WEEKDAY(AE4)=1,WEEKDAY(AE4)=7),\"\",1))","v":"F"},{"$f":"IF(SUMPRODUCT(('Feiertage und Ferien'!$H$8:$H$13<=AF4)*('Feiertage und Ferien'!$I$8:$I$13>=AF4)),\"F\",IF(OR(WEEKDAY(AF4)=1,WEEKDAY(AF4)=7),\"\",1))","v":"F"},{"$f":"COUNT(B5:AF5,\"<0.1\")","v":15},"Januar",{"$f":"Erfassung!G2+20%","v":1},{"$f":"ROUND(AG5*AI5/5,1)*5","v":15}]
[null,{"$f":"AF4+1","v":"2025-02-01"},{"$f":"B6+1","v":"2025-02-02"},"2025-02-03","2025-02-04","2025-02-05","2025-02-06","2025-02-07","2025-02-08","2025-02-09","2025-02-10","2025-02-11","2025-02-12","2025-02-13","2025-02-14","2025-02-15","2025-02-16","2025-02-17","2025-02-18","2025-02-19","2025-02-20","2025-02-21","2025-02-22","2025-02-23","2025-02-24","2025-02-25","2025-02-26","2025-02-27","2025-02-28"]
["Februar",{"$f":"IF(SUMPRODUCT(('Feiertage und Ferien'!$H$8:$H$13<=B6)*('Feiertage und Ferien'!$I$8:$I$13>=B6)),\"F\",IF(OR(WEEKDAY(B6)=1,WEEKDAY(B6)=7),\"\",1))","v":"F"},{"$f":"IF(SUMPRODUCT(('Feiertage und Ferien'!$H$8:$H$13<=C6)*('Feiertage und Ferien'!$I$8:$I$13>=C6)),\"F\",IF(OR(WEEKDAY(C6)=1,WEEKDAY(C6)=7),\"\",1))","v":"F"},{"$f":"IF(SUMPRODUCT(('Feiertage und Ferien'!$H$8:$H$13<=D6)*('Feiertage und Ferien'!$I$8:$I$13>=D6)),\"F\",IF(OR(WEEKDAY(D6)=1,WEEKDAY(D6)=7),\"\",1))","v":"F"},{"$f":"IF(SUMPRODUCT(('Feiertage und Ferien'!$H$8:$H$13<=E6)*('Feiertage und Ferien'!$I$8:$I$13>=E6)),\"F\",IF(OR(WEEKDAY(E6)=1,WEEKDAY(E6)=7),\"\",1))","v":"F"},{"$f":"IF(SUMPRODUCT(('Feiertage und Ferien'!$H$8:$H$13<=F6)*('Feiertage und Ferien'!$I$8:$I$13>=F6)),\"F\",IF(OR(WEEKDAY(F6)=1,WEEKDAY(F6)=7),\"\",1))","v":"F"},{"$f":"IF(SUMPRODUCT(('Feiertage und Ferien'!$H$8:$H$13<=G6)*('Feiertage und Ferien'!$I$8:$I$13>=G6)),\"F\",IF(OR(WEEKDAY(G6)=1,WEEKDAY(G6)=7),\"\",1))","v":"F"},{"$f":"IF(SUMPRODUCT(('Feiertage und Ferien'!$H$8:$H$13<=H6)*('Feiertage und Ferien'!$I$8:$I$13>=H6)),\"F\",IF(OR(WEEKDAY(H6)=1,WEEKDAY(H6)=7),\"\",1))","v":"F"},{"$f":"IF(SUMPRODUCT(('Feiertage und Ferien'!$H$8:$H$13<=I6)*('Feiertage und Ferien'!$I$8:$I$13>=I6)),\"F\",IF(OR(WEEKDAY(I6)=1,WEEKDAY(I6)=7),\"\",1))","v":"F"},{"$f":"IF(SUMPRODUCT(('Feiertage und Ferien'!$H$8:$H$13<=J6)*('Feiertage und Ferien'!$I$8:$I$13>=J6)),\"F\",IF(OR(WEEKDAY(J6)=1,WEEKDAY(J6)=7),\"\",1))","v":""},{"$f":"IF(SUMPRODUCT(('Feiertage und Ferien'!$H$8:$H$13<=K6)*('Feiertage und Ferien'!$I$8:$I$13>=K6)),\"F\",IF(OR(WEEKDAY(K6)=1,WEEKDAY(K6)=7),\"\",1))","v":1},{"$f":"IF(SUMPRODUCT(('Feiertage und Ferien'!$H$8:$H$13<=L6)*('Feiertage und Ferien'!$I$8:$I$13>=L6)),\"F\",IF(OR(WEEKDAY(L6)=1,WEEKDAY(L6)=7),\"\",1))","v":1},{"$f":"IF(SUMPRODUCT(('Feiertage und Ferien'!$H$8:$H$13<=M6)*('Feiertage und Ferien'!$I$8:$I$13>=M6)),\"F\",IF(OR(WEEKDAY(M6)=1,WEEKDAY(M6)=7),\"\",1))","v":1},{"$f":"IF(SUMPRODUCT(('Feiertage und Ferien'!$H$8:$H$13<=N6)*('Feiertage und Ferien'!$I$8:$I$13>=N6)),\"F\",IF(OR(WEEKDAY(N6)=1,WEEKDAY(N6)=7),\"\",1))","v":1},{"$f":"IF(SUMPRODUCT(('Feiertage und Ferien'!$H$8:$H$13<=O6)*('Feiertage und Ferien'!$I$8:$I$13>=O6)),\"F\",IF(OR(WEEKDAY(O6)=1,WEEKDAY(O6)=7),\"\",1))","v":1},{"$f":"IF(SUMPRODUCT(('Feiertage und Ferien'!$H$8:$H$13<=P6)*('Feiertage und Ferien'!$I$8:$I$13>=P6)),\"F\",IF(OR(WEEKDAY(P6)=1,WEEKDAY(P6)=7),\"\",1))","v":""},{"$f":"IF(SUMPRODUCT(('Feiertage und Ferien'!$H$8:$H$13<=Q6)*('Feiertage und Ferien'!$I$8:$I$13>=Q6)),\"F\",IF(OR(WEEKDAY(Q6)=1,WEEKDAY(Q6)=7),\"\",1))","v":""},{"$f":"IF(SUMPRODUCT(('Feiertage und Ferien'!$H$8:$H$13<=R6)*('Feiertage und Ferien'!$I$8:$I$13>=R6)),\"F\",IF(OR(WEEKDAY(R6)=1,WEEKDAY(R6)=7),\"\",1))","v":1},{"$f":"IF(SUMPRODUCT(('Feiertage und Ferien'!$H$8:$H$13<=S6)*('Feiertage und Ferien'!$I$8:$I$13>=S6)),\"F\",IF(OR(WEEKDAY(S6)=1,WEEKDAY(S6)=7),\"\",1))","v":1},{"$f":"IF(SUMPRODUCT(('Feiertage und Ferien'!$H$8:$H$13<=T6)*('Feiertage und Ferien'!$I$8:$I$13>=T6)),\"F\",IF(OR(WEEKDAY(T6)=1,WEEKDAY(T6)=7),\"\",1))","v":1},{"$f":"IF(SUMPRODUCT(('Feiertage und Ferien'!$H$8:$H$13<=U6)*('Feiertage und Ferien'!$I$8:$I$13>=U6)),\"F\",IF(OR(WEEKDAY(U6)=1,WEEKDAY(U6)=7),\"\",1))","v":1},{"$f":"IF(SUMPRODUCT(('Feiertage und Ferien'!$H$8:$H$13<=V6)*('Feiertage und Ferien'!$I$8:$I$13>=V6)),\"F\",IF(OR(WEEKDAY(V6)=1,WEEKDAY(V6)=7),\"\",1))","v":1},{"$f":"IF(SUMPRODUCT(('Feiertage und Ferien'!$H$8:$H$13<=W6)*('Feiertage und Ferien'!$I$8:$I$13>=W6)),\"F\",IF(OR(WEEKDAY(W6)=1,WEEKDAY(W6)=7),\"\",1))","v":""},{"$f":"IF(SUMPRODUCT(('Feiertage und Ferien'!$H$8:$H$13<=X6)*('Feiertage und Ferien'!$I$8:$I$13>=X6)),\"F\",IF(OR(WEEKDAY(X6)=1,WEEKDAY(X6)=7),\"\",1))","v":""},{"$f":"IF(SUMPRODUCT(('Feiertage und Ferien'!$H$8:$H$13<=Y6)*('Feiertage und Ferien'!$I$8:$I$13>=Y6)),\"F\",IF(OR(WEEKDAY(Y6)=1,WEEKDAY(Y6)=7),\"\",1))","v":1},{"$f":"IF(SUMPRODUCT(('Feiertage und Ferien'!$H$8:$H$13<=Z6)*('Feiertage und Ferien'!$I$8:$I$13>=Z6)),\"F\",IF(OR(WEEKDAY(Z6)=1,WEEKDAY(Z6)=7),\"\",1))","v":1},{"$f":"IF(SUMPRODUCT(('Feiertage und Ferien'!$H$8:$H$13<=AA6)*('Feiertage und Ferien'!$I$8:$I$13>=AA6)),\"F\",IF(OR(WEEKDAY(AA6)=1,WEEKDAY(AA6)=7),\"\",1))","v":1},{"$f":"IF(SUMPRODUCT(('Feiertage und Ferien'!$H$8:$H$13<=AB6)*('Feiertage und Ferien'!$I$8:$I$13>=AB6)),\"F\",IF(OR(WEEKDAY(AB6)=1,WEEKDAY(AB6)=7),\"\",1))","v":1},{"$f":"IF(SUMPRODUCT(('Feiertage und Ferien'!$H$8:$H$13<=AC6)*('Feiertage und Ferien'!$I$8:$I$13>=AC6)),\"F\",IF(OR(WEEKDAY(AC6)=1,WEEKDAY(AC6)=7),\"\",1))","v":1},{"$f":"IF(SUMPRODUCT(('Feiertage und Ferien'!$H$8:$H$13<=AD6)*('Feiertage und Ferien'!$I$8:$I$13>=AD6)),\"F\",IF(OR(WEEKDAY(AD6)=1,WEEKDAY(AD6)=7),\"\",1))","v":""},{"$f":"IF(SUMPRODUCT(('Feiertage und Ferien'!$H$8:$H$13<=AE6)*('Feiertage und Ferien'!$I$8:$I$13>=AE6)),\"F\",IF(OR(WEEKDAY(AE6)=1,WEEKDAY(AE6)=7),\"\",1))","v":""},{"$f":"IF(SUMPRODUCT(('Feiertage und Ferien'!$H$8:$H$13<=AF6)*('Feiertage und Ferien'!$I$8:$I$13>=AF6)),\"F\",IF(OR(WEEKDAY(AF6)=1,WEEKDAY(AF6)=7),\"\",1))","v":""},{"$f":"COUNT(B7:AF7,\"<0.1\")","v":15},"Februar",{"$f":"Erfassung!H2+20%","v":1},{"$f":"ROUND(AG7*AI7/5,1)*5","v":15}]
[null,{"$f":"AC6+1","v":"2025-03-01"},{"$f":"B8+1","v":"2025-03-02"},"2025-03-03","2025-03-04","2025-03-05","2025-03-06","2025-03-07","2025-03-08","2025-03-09","2025-03-10","2025-03-11","2025-03-12","2025-03-13","2025-03-14","2025-03-15","2025-03-16","2025-03-17","2025-03-18","2025-03-19","2025-03-20","2025-03-21","2025-03-22","2025-03-23","2025-03-24","2025-03-25","2025-03-26","2025-03-27","2025-03-28","2025-03-29",{"$f":"AD8+1","v":"2025-03-30"},{"$f":"AE8+1","v":"2025-03-31"}]
["März",{"$f":"IF(SUMPRODUCT(('Feiertage und Ferien'!$H$8:$H$13<=B8)*('Feiertage und Ferien'!$I$8:$I$13>=B8)),\"F\",IF(OR(WEEKDAY(B8)=1,WEEKDAY(B8)=7),\"\",1))","v":""},{"$f":"IF(SUMPRODUCT(('Feiertage und Ferien'!$H$8:$H$13<=C8)*('Feiertage und Ferien'!$I$8:$I$13>=C8)),\"F\",IF(OR(WEEKDAY(C8)=1,WEEKDAY(C8)=7),\"\",1))","v":""},{"$f":"IF(SUMPRODUCT(('Feiertage und Ferien'!$H$8:$H$13<=D8)*('Feiertage und Ferien'!$I$8:$I$13>=D8)),\"F\",IF(OR(WEEKDAY(D8)=1,WEEKDAY(D8)=7),\"\",1))","v":1},{"$f":"IF(SUMPRODUCT(('Feiertage und Ferien'!$H$8:$H$13<=E8)*('Feiertage und Ferien'!$I$8:$I$13>=E8)),\"F\",IF(OR(WEEKDAY(E8)=1,WEEKDAY(E8)=7),\"\",1))","v":1},{"$f":"IF(SUMPRODUCT(('Feiertage und Ferien'!$H$8:$H$13<=F8)*('Feiertage und Ferien'!$I$8:$I$13>=F8)),\"F\",IF(OR(WEEKDAY(F8)=1,WEEKDAY(F8)=7),\"\",1))","v":1},{"$f":"IF(SUMPRODUCT(('Feiertage und Ferien'!$H$8:$H$13<=G8)*('Feiertage und Ferien'!$I$8:$I$13>=G8)),\"F\",IF(OR(WEEKDAY(G8)=1,WEEKDAY(G8)=7),\"\",1))","v":1},{"$f":"IF(SUMPRODUCT(('Feiertage und Ferien'!$H$8:$H$13<=H8)*('Feiertage und Ferien'!$I$8:$I$13>=H8)),\"F\",IF(OR(WEEKDAY(H8)=1,WEEKDAY(H8)=7),\"\",1))","v":1},{"$f":"IF(SUMPRODUCT(('Feiertage und Ferien'!$H$8:$H$13<=I8)*('Feiertage und Ferien'!$I$8:$I$13>=I8)),\"F\",IF(OR(WEEKDAY(I8)=1,WEEKDAY(I8)=7),\"\",1))","v":""},{"$f":"IF(SUMPRODUCT(('Feiertage und Ferien'!$H$8:$H$13<=J8)*('Feiertage und Ferien'!$I$8:$I$13>=J8)),\"F\",IF(OR(WEEKDAY(J8)=1,WEEKDAY(J8)=7),\"\",1))","v":""},{"$f":"IF(SUMPRODUCT(('Feiertage und Ferien'!$H$8:$H$13<=K8)*('Feiertage und Ferien'!$I$8:$I$13>=K8)),\"F\",IF(OR(WEEKDAY(K8)=1,WEEKDAY(K8)=7),\"\",1))","v":1},{"$f":"IF(SUMPRODUCT(('Feiertage und Ferien'!$H$8:$H$13<=L8)*('Feiertage und Ferien'!$I$8:$I$13>=L8)),\"F\",IF(OR(WEEKDAY(L8)=1,WEEKDAY(L8)=7),\"\",1))","v":1},{"$f":"IF(SUMPRODUCT(('Feiertage und Ferien'!$H$8:$H$13<=M8)*('Feiertage und Ferien'!$I$8:$I$13>=M8)),\"F\",IF(OR(WEEKDAY(M8)=1,WEEKDAY(M8)=7),\"\",1))","v":1},{"$f":"IF(SUMPRODUCT(('Feiertage und Ferien'!$H$8:$H$13<=N8)*('Feiertage und Ferien'!$I$8:$I$13>=N8)),\"F\",IF(OR(WEEKDAY(N8)=1,WEEKDAY(N8)=7),\"\",1))","v":1},{"$f":"IF(SUMPRODUCT(('Feiertage und Ferien'!$H$8:$H$13<=O8)*('Feiertage und Ferien'!$I$8:$I$13>=O8)),\"F\",IF(OR(WEEKDAY(O8)=1,WEEKDAY(O8)=7),\"\",1))","v":1},{"$f":"IF(SUMPRODUCT(('Feiertage und Ferien'!$H$8:$H$13<=P8)*('Feiertage und Ferien'!$I$8:$I$13>=P8)),\"F\",IF(OR(WEEKDAY(P8)=1,WEEKDAY(P8)=7),\"\",1))","v":""},{"$f":"IF(SUMPRODUCT(('Feiertage und Ferien'!$H$8:$H$13<=Q8)*('Feiertage und Ferien'!$I$8:$I$13>=Q8)),\"F\",IF(OR(WEEKDAY(Q8)=1,WEEKDAY(Q8)=7),\"\",1))","v":""},{"$f":"IF(SUMPRODUCT(('Feiertage und Ferien'!$H$8:$H$13<=R8)*('Feiertage und Ferien'!$I$8:$I$13>=R8)),\"F\",IF(OR(WEEKDAY(R8)=1,WEEKDAY(R8)=7),\"\",1))","v":1},{"$f":"IF(SUMPRODUCT(('Feiertage und Ferien'!$H$8:$H$13<=S8)*('Feiertage und Ferien'!$I$8:$I$13>=S8)),\"F\",IF(OR(WEEKDAY(S8)=1,WEEKDAY(S8)=7),\"\",1))","v":1},{"$f":"IF(SUMPRODUCT(('Feiertage und Ferien'!$H$8:$H$13<=T8)*('Feiertage und Ferien'!$I$8:$I$13>=T8)),\"F\",IF(OR(WEEKDAY(T8)=1,WEEKDAY(T8)=7),\"\",1))","v":1},{"$f":"IF(SUMPRODUCT(('Feiertage und Ferien'!$H$8:$H$13<=U8)*('Feiertage und Ferien'!$I$8:$I$13>=U8)),\"F\",IF(OR(WEEKDAY(U8)=1,WEEKDAY(U8)=7),\"\",1))","v":1},{"$f":"IF(SUMPRODUCT(('Feiertage und Ferien'!$H$8:$H$13<=V8)*('Feiertage und Ferien'!$I$8:$I$13>=V8)),\"F\",IF(OR(WEEKDAY(V8)=1,WEEKDAY(V8)=7),\"\",1))","v":1},{"$f":"IF(SUMPRODUCT(('Feiertage und Ferien'!$H$8:$H$13<=W8)*('Feiertage und Ferien'!$I$8:$I$13>=W8)),\"F\",IF(OR(WEEKDAY(W8)=1,WEEKDAY(W8)=7),\"\",1))","v":""},{"$f":"IF(SUMPRODUCT(('Feiertage und Ferien'!$H$8:$H$13<=X8)*('Feiertage und Ferien'!$I$8:$I$13>=X8)),\"F\",IF(OR(WEEKDAY(X8)=1,WEEKDAY(X8)=7),\"\",1))","v":""},{"$f":"IF(SUMPRODUCT(('Feiertage und Ferien'!$H$8:$H$13<=Y8)*('Feiertage und Ferien'!$I$8:$I$13>=Y8)),\"F\",IF(OR(WEEKDAY(Y8)=1,WEEKDAY(Y8)=7),\"\",1))","v":1},{"$f":"IF(SUMPRODUCT(('Feiertage und Ferien'!$H$8:$H$13<=Z8)*('Feiertage und Ferien'!$I$8:$I$13>=Z8)),\"F\",IF(OR(WEEKDAY(Z8)=1,WEEKDAY(Z8)=7),\"\",1))","v":1},{"$f":"IF(SUMPRODUCT(('Feiertage und Ferien'!$H$8:$H$13<=AA8)*('Feiertage und Ferien'!$I$8:$I$13>=AA8)),\"F\",IF(OR(WEEKDAY(AA8)=1,WEEKDAY(AA8)=7),\"\",1))","v":1},{"$f":"IF(SUMPRODUCT(('Feiertage und Ferien'!$H$8:$H$13<=AB8)*('Feiertage und Ferien'!$I$8:$I$13>=AB8)),\"F\",IF(OR(WEEKDAY(AB8)=1,WEEKDAY(AB8)=7),\"\",1))","v":1},{"$f":"IF(SUMPRODUCT(('Feiertage und Ferien'!$H$8:$H$13<=AC8)*('Feiertage und Ferien'!$I$8:$I$13>=AC8)),\"F\",IF(OR(WEEKDAY(AC8)=1,WEEKDAY(AC8)=7),\"\",1))","v":1},{"$f":"IF(SUMPRODUCT(('Feiertage und Ferien'!$H$8:$H$13<=AD8)*('Feiertage und Ferien'!$I$8:$I$13>=AD8)),\"F\",IF(OR(WEEKDAY(AD8)=1,WEEKDAY(AD8)=7),\"\",1))","v":""},{"$f":"IF(SUMPRODUCT(('Feiertage und Ferien'!$H$8:$H$13<=AE8)*('Feiertage und Ferien'!$I$8:$I$13>=AE8)),\"F\",IF(OR(WEEKDAY(AE8)=1,WEEKDAY(AE8)=7),\"\",1))","v":""},{"$f":"IF(SUMPRODUCT(('Feiertage und Ferien'!$H$8:$H$13<=AF8)*('Feiertage und Ferien'!$I$8:$I$13>=AF8)),\"F\",IF(OR(WEEKDAY(AF8)=1,WEEKDAY(AF8)=7),\"\",1))","v":1},{"$f":"COUNT(B9:AF9,\"<0.1\")","v":21},"März",{"$f":"Erfassung!I2+20%","v":1},{"$f":"ROUND(AG9*AI9/5,1)*5","v":21}]
[null,{"$f":"AF8+1","v":"2025-04-01"},{"$f":"B10+1","v":"2025-04-02"},"2025-04-03","2025-04-04","2025-04-05","2025-04-06","2025-04-07","2025-04-08","2025-04-09","2025-04-10","2025-04-11","2025-04-12","2025-04-13","2025-04-14","2025-04-15","2025-04-16","2025-04-17","2025-04-18","2025-04-19","2025-04-20","2025-04-21","2025-04-22","2025-04-23","2025-04-24","2025-04-25","2025-04-26","2025-04-27","2025-04-28","2025-04-29","2025-04-30"]
["April",{"$f":"IF(SUMPRODUCT(('Feiertage und Ferien'!$H$8:$H$13<=B10)*('Feiertage und Ferien'!$I$8:$I$13>=B10)),\"F\",IF(OR(WEEKDAY(B10)=1,WEEKDAY(B10)=7),\"\",1))","v":1},{"$f":"IF(SUMPRODUCT(('Feiertage und Ferien'!$H$8:$H$13<=C10)*('Feiertage und Ferien'!$I$8:$I$13>=C10)),\"F\",IF(OR(WEEKDAY(C10)=1,WEEKDAY(C10)=7),\"\",1))","v":1},{"$f":"IF(SUMPRODUCT(('Feiertage und Ferien'!$H$8:$H$13<=D10)*('Feiertage und Ferien'!$I$8:$I$13>=D10)),\"F\",IF(OR(WEEKDAY(D10)=1,WEEKDAY(D10)=7),\"\",1))","v":1},{"$f":"IF(SUMPRODUCT(('Feiertage und Ferien'!$H$8:$H$13<=E10)*('Feiertage und Ferien'!$I$8:$I$13>=E10)),\"F\",IF(OR(WEEKDAY(E10)=1,WEEKDAY(E10)=7),\"\",1))","v":1},{"$f":"IF(SUMPRODUCT(('Feiertage und Ferien'!$H$8:$H$13<=F10)*('Feiertage und Ferien'!$I$8:$I$13>=F10)),\"F\",IF(OR(WEEKDAY(F10)=1,WEEKDAY(F10)=7),\"\",1))","v":""},{"$f":"IF(SUMPRODUCT(('Feiertage und Ferien'!$H$8:$H$13<=G10)*('Feiertage und Ferien'!$I$8:$I$13>=G10)),\"F\",IF(OR(WEEKDAY(G10)=1,WEEKDAY(G10)=7),\"\",1))","v":""},{"$f":"IF(SUMPRODUCT(('Feiertage und Ferien'!$H$8:$H$13<=H10)*('Feiertage und Ferien'!$I$8:$I$13>=H10)),\"F\",IF(OR(WEEKDAY(H10)=1,WEEKDAY(H10)=7),\"\",1))","v":1},{"$f":"IF(SUMPRODUCT(('Feiertage und Ferien'!$H$8:$H$13<=I10)*('Feiertage und Ferien'!$I$8:$I$13>=I10)),\"F\",IF(OR(WEEKDAY(I10)=1,WEEKDAY(I10)=7),\"\",1))","v":1},{"$f":"IF(SUMPRODUCT(('Feiertage und Ferien'!$H$8:$H$13<=J10)*('Feiertage und Ferien'!$I$8:$I$13>=J10)),\"F\",IF(OR(WEEKDAY(J10)=1,WEEKDAY(J10)=7),\"\",1))","v":1},{"$f":"IF(SUMPRODUCT(('Feiertage und Ferien'!$H$8:$H$13<=K10)*('Feiertage und Ferien'!$I$8:$I$13>=K10)),\"F\",IF(OR(WEEKDAY(K10)=1,WEEKDAY(K10)=7),\"\",1))","v":1},{"$f":"IF(SUMPRODUCT(('Feiertage und Ferien'!$H$8:$H$13<=L10)*('Feiertage und Ferien'!$I$8:$I$13>=L10)),\"F\",IF(OR(WEEKDAY(L10)=1,WEEKDAY(L10)=7),\"\",1))","v":1},{"$f":"IF(SUMPRODUCT(('Feiertage und Ferien'!$H$8:$H$13<=M10)*('Feiertage und Ferien'!$I$8:$I$13>=M10)),\"F\",IF(OR(WEEKDAY(M10)=1,WEEKDAY(M10)=7),\"\",1))","v":""},{"$f":"IF(SUMPRODUCT(('Feiertage und Ferien'!$H$8:$H$13<=N10)*('Feiertage und Ferien'!$I$8:$I$13>=N10)),\"F\",IF(OR(WEEKDAY(N10)=1,WEEKDAY(N10)=7),\"\",1))","v":""},{"$f":"IF(SUMPRODUCT(('Feiertage und Ferien'!$H$8:$H$13<=O10)*('Feiertage und Ferien'!$I$8:$I$13>=O10)),\"F\",IF(OR(WEEKDAY(O10)=1,WEEKDAY(O10)=7),\"\",1))","v":1},{"$f":"IF(SUMPRODUCT(('Feiertage und Ferien'!$H$8:$H$13<=P10)*('Feiertage und Ferien'!$I$8:$I$13>=P10)),\"F\",IF(OR(WEEKDAY(P10)=1,WEEKDAY(P10)=7),\"\",1))","v":1},{"$f":"IF(SUMPRODUCT(('Feiertage und Ferien'!$H$8:$H$13<=Q10)*('Feiertage und Ferien'!$I$8:$I$13>=Q10)),\"F\",IF(OR(WEEKDAY(Q10)=1,WEEKDAY(Q10)=7),\"\",1))","v":1},{"$f":"IF(SUMPRODUCT(('Feiertage und Ferien'!$H$8:$H$13<=R10)*('Feiertage und Ferien'!$I$8:$I$13>=R10)),\"F\",IF(OR(WEEKDAY(R10)=1,WEEKDAY(R10)=7),\"\",1))","v":1},{"$f":"IF(SUMPRODUCT(('Feiertage und Ferien'!$H$8:$H$13<=S10)*('Feiertage und Ferien'!$I$8:$I$13>=S10)),\"F\",IF(OR(WEEKDAY(S10)=1,WEEKDAY(S10)=7),\"\",1))","v":1},{"$f":"IF(SUMPRODUCT(('Feiertage und Ferien'!$H$8:$H$13<=T10)*('Feiertage und Ferien'!$I$8:$I$13>=T10)),\"F\",IF(OR(WEEKDAY(T10)=1,WEEKDAY(T10)=7),\"\",1))","v":""},{"$f":"IF(SUMPRODUCT(('Feiertage und Ferien'!$H$8:$H$13<=U10)*('Feiertage und Ferien'!$I$8:$I$13>=U10)),\"F\",IF(OR(WEEKDAY(U10)=1,WEEKDAY(U10)=7),\"\",1))","v":""},{"$f":"IF(SUMPRODUCT(('Feiertage und Ferien'!$H$8:$H$13<=V10)*('Feiertage und Ferien'!$I$8:$I$13>=V10)),\"F\",IF(OR(WEEKDAY(V10)=1,WEEKDAY(V10)=7),\"\",1))","v":1},{"$f":"IF(SUMPRODUCT(('Feiertage und Ferien'!$H$8:$H$13<=W10)*('Feiertage und Ferien'!$I$8:$I$13>=W10)),\"F\",IF(OR(WEEKDAY(W10)=1,WEEKDAY(W10)=7),\"\",1))","v":1},{"$f":"IF(SUMPRODUCT(('Feiertage und Ferien'!$H$8:$H$13<=X10)*('Feiertage und Ferien'!$I$8:$I$13>=X10)),\"F\",IF(OR(WEEKDAY(X10)=1,WEEKDAY(X10)=7),\"\",1))","v":1},{"$f":"IF(SUMPRODUCT(('Feiertage und Ferien'!$H$8:$H$13<=Y10)*('Feiertage und Ferien'!$I$8:$I$13>=Y10)),\"F\",IF(OR(WEEKDAY(Y10)=1,WEEKDAY(Y10)=7),\"\",1))","v":1},{"$f":"IF(SUMPRODUCT(('Feiertage und Ferien'!$H$8:$H$13<=Z10)*('Feiertage und Ferien'!$I$8:$I$13>=Z10)),\"F\",IF(OR(WEEKDAY(Z10)=1,WEEKDAY(Z10)=7),\"\",1))","v":1},{"$f":"IF(SUMPRODUCT(('Feiertage und Ferien'!$H$8:$H$13<=AA10)*('Feiertage und Ferien'!$I$8:$I$13>=AA10)),\"F\",IF(OR(WEEKDAY(AA10)=1,WEEKDAY(AA10)=7),\"\",1))","v":""},{"$f":"IF(SUMPRODUCT(('Feiertage und Ferien'!$H$8:$H$13<=AB10)*('Feiertage und Ferien'!$I$8:$I$13>=AB10)),\"F\",IF(OR(WEEKDAY(AB10)=1,WEEKDAY(AB10)=7),\"\",1))","v":""},{"$f":"IF(SUMPRODUCT(('Feiertage und Ferien'!$H$8:$H$13<=AC10)*('Feiertage und Ferien'!$I$8:$I$13>=AC10)),\"F\",IF(OR(WEEKDAY(AC10)=1,WEEKDAY(AC10)=7),\"\",1))","v":1},{"$f":"IF(SUMPRODUCT(('Feiertage und Ferien'!$H$8:$H$13<=AD10)*('Feiertage und Ferien'!$I$8:$I$13>=AD10)),\"F\",IF(OR(WEEKDAY(AD10)=1,WEEKDAY(AD10)=7),\"\",1))","v":1},{"$f":"IF(SUMPRODUCT(('Feiertage und Ferien'!$H$8:$H$13<=AE10)*('Feiertage und Ferien'!$I$8:$I$13>=AE10)),\"F\",IF(OR(WEEKDAY(AE10)=1,WEEKDAY(AE10)=7),\"\",1))","v":1},{"$f":"IF(SUMPRODUCT(('Feiertage und Ferien'!$H$8:$H$13<=AF10)*('Feiertage und Ferien'!$I$8:$I$13>=AF10)),\"F\",IF(OR(WEEKDAY(AF10)=1,WEEKDAY(AF10)=7),\"\",1))","v":""},{"$f":"COUNT(B11:AF11,\"<0.1\")","v":22},"April",{"$f":"Erfassung!J2+20%","v":1},{"$f":"ROUND(AG11*AI11/5,1)*5","v":22}]
[null,{"$f":"AE10+1","v":"2025-05-01"},{"$f":"B12+1","v":"2025-05-02"},"2025-05-03","2025-05-04","2025-05-05","2025-05-06","2025-05-07","2025-05-08","2025-05-09","2025-05-10","2025-05-11","2025-05-12","2025-05-13","2025-05-14","2025-05-15","2025-05-16","2025-05-17","2025-05-18","2025-05-19","2025-05-20","2025-05-21","2025-05-22","2025-05-23","2025-05-24","2025-05-25","2025-05-26","2025-05-27","2025-05-28","2025-05-29","2025-05-30","2025-05-31"]
["Mai",{"$f":"IF(SUMPRODUCT(('Feiertage und Ferien'!$H$8:$H$13<=B12)*('Feiertage und Ferien'!$I$8:$I$13>=B12)),\"F\",IF(OR(WEEKDAY(B12)=1,WEEKDAY(B12)=7),\"\",1))","v":1},{"$f":"IF(SUMPRODUCT(('Feiertage und Ferien'!$H$8:$H$13<=C12)*('Feiertage und Ferien'!$I$8:$I$13>=C12)),\"F\",IF(OR(WEEKDAY(C12)=1,WEEKDAY(C12)=7),\"\",1))","v":1},{"$f":"IF(SUMPRODUCT(('Feiertage und Ferien'!$H$8:$H$13<=D12)*('Feiertage und Ferien'!$I$8:$I$13>=D12)),\"F\",IF(OR(WEEKDAY(D12)=1,WEEKDAY(D12)=7),\"\",1))","v":"F"},{"$f":"IF(SUMPRODUCT(('Feiertage und Ferien'!$H$8:$H$13<=E12)*('Feiertage und Ferien'!$I$8:$I$13>=E12)),\"F\",IF(OR(WEEKDAY(E12)=1,WEEKDAY(E12)=7),\"\",1))","v":"F"},{"$f":"IF(SUMPRODUCT(('Feiertage und Ferien'!$H$8:$H$13<=F12)*('Feiertage und Ferien'!$I$8:$I$13>=F12)),\"F\",IF(OR(WEEKDAY(F12)=1,WEEKDAY(F12)=7),\"\",1))","v":"F"},{"$f":"IF(SUMPRODUCT(('Feiertage und Ferien'!$H$8:$H$13<=G12)*('Feiertage und Ferien'!$I$8:$I$13>=G12)),\"F\",IF(OR(WEEKDAY(G12)=1,WEEKDAY(G12)=7),\"\",1))","v":"F"},{"$f":"IF(SUMPRODUCT(('Feiertage und Ferien'!$H$8:$H$13<=H12)*('Feiertage und Ferien'!$I$8:$I$13>=H12)),\"F\",IF(OR(WEEKDAY(H12)=1,WEEKDAY(H12)=7),\"\",1))","v":"F"},{"$f":"IF(SUMPRODUCT(('Feiertage und Ferien'!$H$8:$H$13<=I12)*('Feiertage und Ferien'!$I$8:$I$13>=I12)),\"F\",IF(OR(WEEKDAY(I12)=1,WEEKDAY(I12)=7),\"\",1))","v":"F"},{"$f":"IF(SUMPRODUCT(('Feiertage und Ferien'!$H$8:$H$13<=J12)*('Feiertage und Ferien'!$I$8:$I$13>=J12)),\"F\",IF(OR(WEEKDAY(J12)=1,WEEKDAY(J12)=7),\"\",1))","v":"F"},{"$f":"IF(SUMPRODUCT(('Feiertage und Ferien'!$H$8:$H$13<=K12)*('Feiertage und Ferien'!$I$8:$I$13>=K12)),\"F\",IF(OR(WEEKDAY(K12)=1,WEEKDAY(K12)=7),\"\",1))","v":"F"},{"$f":"IF(SUMPRODUCT(('Feiertage und Ferien'!$H$8:$H$13<=L12)*('Feiertage und Ferien'!$I$8:$I$13>=L12)),\"F\",IF(OR(WEEKDAY(L12)=1,WEEKDAY(L12)=7),\"\",1))","v":"F"},{"$f":"IF(SUMPRODUCT(('Feiertage und Ferien'!$H$8:$H$13<=M12)*('Feiertage und Ferien'!$I$8:$I$13>=M12)),\"F\",IF(OR(WEEKDAY(M12)=1,WEEKDAY(M12)=7),\"\",1))","v":"F"},{"$f":"IF(SUMPRODUCT(('Feiertage und Ferien'!$H$8:$H$13<=N12)*('Feiertage und Ferien'!$I$8:$I$13>=N12)),\"F\",IF(OR(WEEKDAY(N12)=1,WEEKDAY(N12)=7),\"\",1))","v":"F"},{"$f":"IF(SUMPRODUCT(('Feiertage und Ferien'!$H$8:$H$13<=O12)*('Feiertage und Ferien'!$I$8:$I$13>=O12)),\"F\",IF(OR(WEEKDAY(O12)=1,WEEKDAY(O12)=7),\"\",1))","v":"F"},{"$f":"IF(SUMPRODUCT(('Feiertage und Ferien'!$H$8:$H$13<=P12)*('Feiertage und Ferien'!$I$8:$I$13>=P12)),\"F\",IF(OR(WEEKDAY(P12)=1,WEEKDAY(P12)=7),\"\",1))","v":"F"},{"$f":"IF(SUMPRODUCT(('Feiertage und Ferien'!$H$8:$H$13<=Q12)*('Feiertage und Ferien'!$I$8:$I$13>=Q12)),\"F\",IF(OR(WEEKDAY(Q12)=1,WEEKDAY(Q12)=7),\"\",1))","v":"F"},{"$f":"IF(SUMPRODUCT(('Feiertage und Ferien'!$H$8:$H$13<=R12)*('Feiertage und Ferien'!$I$8:$I$13>=R12)),\"F\",IF(OR(WEEKDAY(R12)=1,WEEKDAY(R12)=7),\"\",1))","v":"F"},{"$f":"IF(SUMPRODUCT(('Feiertage und Ferien'!$H$8:$H$13<=S12)*('Feiertage und Ferien'!$I$8:$I$13>=S12)),\"F\",IF(OR(WEEKDAY(S12)=1,WEEKDAY(S12)=7),\"\",1))","v":""},{"$f":"IF(SUMPRODUCT(('Feiertage und Ferien'!$H$8:$H$13<=T12)*('Feiertage und Ferien'!$I$8:$I$13>=T12)),\"F\",IF(OR(WEEKDAY(T12)=1,WEEKDAY(T12)=7),\"\",1))","v":1},{"$f":"IF(SUMPRODUCT(('Feiertage und Ferien'!$H$8:$H$13<=U12)*('Feiertage und Ferien'!$I$8:$I$13>=U12)),\"F\",IF(OR(WEEKDAY(U12)=1,WEEKDAY(U12)=7),\"\",1))","v":1},{"$f":"IF(SUMPRODUCT(('Feiertage und Ferien'!$H$8:$H$13<=V12)*('Feiertage und Ferien'!$I$8:$I$13>=V12)),\"F\",IF(OR(WEEKDAY(V12)=1,WEEKDAY(V12)=7),\"\",1))","v":1},{"$f":"IF(SUMPRODUCT(('Feiertage und Ferien'!$H$8:$H$13<=W12)*('Feiertage und Ferien'!$I$8:$I$13>=W12)),\"F\",IF(OR(WEEKDAY(W12)=1,WEEKDAY(W12)=7),\"\",1))","v":1},{"$f":"IF(SUMPRODUCT(('Feiertage und Ferien'!$H$8:$H$13<=X12)*('Feiertage und Ferien'!$I$8:$I$13>=X12)),\"F\",IF(OR(WEEKDAY(X12)=1,WEEKDAY(X12)=7),\"\",1))","v":1},{"$f":"IF(SUMPRODUCT(('Feiertage und Ferien'!$H$8:$H$13<=Y12)*('Feiertage und Ferien'!$I$8:$I$13>=Y12)),\"F\",IF(OR(WEEKDAY(Y12)=1,WEEKDAY(Y12)=7),\"\",1))","v":""},{"$f":"IF(SUMPRODUCT(('Feiertage und Ferien'!$H$8:$H$13<=Z12)*('Feiertage und Ferien'!$I$8:$I$13>=Z12)),\"F\",IF(OR(WEEKDAY(Z12)=1,WEEKDAY(Z12)=7),\"\",1))","v":""},{"$f":"IF(SUMPRODUCT(('Feiertage und Ferien'!$H$8:$H$13<=AA12)*('Feiertage und Ferien'!$I$8:$I$13>=AA12)),\"F\",IF(OR(WEEKDAY(AA12)=1,WEEKDAY(AA12)=7),\"\",1))","v":1},{"$f":"IF(SUMPRODUCT(('Feiertage und Ferien'!$H$8:$H$13<=AB12)*('Feiertage und Ferien'!$I$8:$I$13>=AB12)),\"F\",IF(OR(WEEKDAY(AB12)=1,WEEKDAY(AB12)=7),\"\",1))","v":1},{"$f":"IF(SUMPRODUCT(('Feiertage und Ferien'!$H$8:$H$13<=AC12)*('Feiertage und Ferien'!$I$8:$I$13>=AC12)),\"F\",IF(OR(WEEKDAY(AC12)=1,WEEKDAY(AC12)=7),\"\",1))","v":1},{"$f":"IF(SUMPRODUCT(('Feiertage und Ferien'!$H$8:$H$13<=AD12)*('Feiertage und Ferien'!$I$8:$I$13>=AD12)),\"F\",IF(OR(WEEKDAY(AD12)=1,WEEKDAY(AD12)=7),\"\",1))","v":1},{"$f":"IF(SUMPRODUCT(('Feiertage und Ferien'!$H$8:$H$13<=AE12)*('Feiertage und Ferien'!$I$8:$I$13>=AE12)),\"F\",IF(OR(WEEKDAY(AE12)=1,WEEKDAY(AE12)=7),\"\",1))","v":1},{"$f":"IF(SUMPRODUCT(('Feiertage und Ferien'!$H$8:$H$13<=AF12)*('Feiertage und Ferien'!$I$8:$I$13>=AF12)),\"F\",IF(OR(WEEKDAY(AF12)=1,WEEKDAY(AF12)=7),\"\",1))","v":""},{"$f":"COUNT(B13:AF13,\"<0.1\")","v":12},"Mai",{"$f":"Erfassung!K2+20%","v":1},{"$f":"ROUND(AG13*AI13/5,1)*5","v":12}]
[null,{"$f":"AF12+1","v":"2025-06-01"},{"$f":"B14+1","v":"2025-06-02"},"2025-06-03","2025-06-04","2025-06-05","2025-06-06","2025-06-07","2025-06-08","2025-06-09","2025-06-10","2025-06-11","2025-06-12","2025-06-13","2025-06-14","2025-06-15","2025-06-16","2025-06-17","2025-06-18","2025-06-19","2025-06-20","2025-06-21","2025-06-22","2025-06-23","2025-06-24","2025-06-25","2025-06-26","2025-06-27","2025-06-28","2025-06-29","2025-06-30"]
["Juni",{"$f":"IF(SUMPRODUCT(('Feiertage und Ferien'!$H$8:$H$13<=B14)*('Feiertage und Ferien'!$I$8:$I$13>=B14)),\"F\",IF(OR(WEEKDAY(B14)=1,WEEKDAY(B14)=7),\"\",1))","v":""},{"$f":"IF(SUMPRODUCT(('Feiertage und Ferien'!$H$8:$H$13<=C14)*('Feiertage und Ferien'!$I$8:$I$13>=C14)),\"F\",IF(OR(WEEKDAY(C14)=1,WEEKDAY(C14)=7),\"\",1))","v":1},{"$f":"IF(SUMPRODUCT(('Feiertage und Ferien'!$H$8:$H$13<=D14)*('Feiertage und Ferien'!$I$8:$I$13>=D14)),\"F\",IF(OR(WEEKDAY(D14)=1,WEEKDAY(D14)=7),\"\",1))","v":1},{"$f":"IF(SUMPRODUCT(('Feiertage und Ferien'!$H$8:$H$13<=E14)*('Feiertage und Ferien'!$I$8:$I$13>=E14)),\"F\",IF(OR(WEEKDAY(E14)=1,WEEKDAY(E14)=7),\"\",1))","v":1},{"$f":"IF(SUMPRODUCT(('Feiertage und Ferien'!$H$8:$H$13<=F14)*('Feiertage und Ferien'!$I$8:$I$13>=F14)),\"F\",IF(OR(WEEKDAY(F14)=1,WEEKDAY(F14)=7),\"\",1))","v":1},{"$f":"IF(SUMPRODUCT(('Feiertage und Ferien'!$H$8:$H$13<=G14)*('Feiertage und Ferien'!$I$8:$I$13>=G14)),\"F\",IF(OR(WEEKDAY(G14)=1,WEEKDAY(G14)=7),\"\",1))","v":1},{"$f":"IF(SUMPRODUCT(('Feiertage und Ferien'!$H$8:$H$13<=H14)*('Feiertage und Ferien'!$I$8:$I$13>=H14)),\"F\",IF(OR(WEEKDAY(H14)=1,WEEKDAY(H14)=7),\"\",1))","v":""},{"$f":"IF(SUMPRODUCT(('Feiertage und Ferien'!$H$8:$H$13<=I14)*('Feiertage und Ferien'!$I$8:$I$13>=I14)),\"F\",IF(OR(WEEKDAY(I14)=1,WEEKDAY(I14)=7),\"\",1))","v":""},{"$f":"IF(SUMPRODUCT(('Feiertage und Ferien'!$H$8:$H$13<=J14)*('Feiertage und Ferien'!$I$8:$I$13>=J14)),\"F\",IF(OR(WEEKDAY(J14)=1,WEEKDAY(J14)=7),\"\",1))","v":1},{"$f":"IF(SUMPRODUCT(('Feiertage und Ferien'!$H$8:$H$13<=K14)*('Feiertage und Ferien'!$I$8:$I$13>=K14)),\"F\",IF(OR(WEEKDAY(K14)=1,WEEKDAY(K14)=7),\"\",1))","v":1},{"$f":"IF(SUMPRODUCT(('Feiertage und Ferien'!$H$8:$H$13<=L14)*('Feiertage und Ferien'!$I$8:$I$13>=L14)),\"F\",IF(OR(WEEKDAY(L14)=1,WEEKDAY(L14)=7),\"\",1))","v":1},{"$f":"IF(SUMPRODUCT(('Feiertage und Ferien'!$H$8:$H$13<=M14)*('Feiertage und Ferien'!$I$8:$I$13>=M14)),\"F\",IF(OR(WEEKDAY(M14)=1,WEEKDAY(M14)=7),\"\",1))","v":1},{"$f":"IF(SUMPRODUCT(('Feiertage und Ferien'!$H$8:$H$13<=N14)*('Feiertage und Ferien'!$I$8:$I$13>=N14)),\"F\",IF(OR(WEEKDAY(N14)=1,WEEKDAY(N14)=7),\"\",1))","v":1},{"$f":"IF(SUMPRODUCT(('Feiertage und Ferien'!$H$8:$H$13<=O14)*('Feiertage und Ferien'!$I$8:$I$13>=O14)),\"F\",IF(OR(WEEKDAY(O14)=1,WEEKDAY(O14)=7),\"\",1))","v":""},{"$f":"IF(SUMPRODUCT(('Feiertage und Ferien'!$H$8:$H$13<=P14)*('Feiertage und Ferien'!$I$8:$I$13>=P14)),\"F\",IF(OR(WEEKDAY(P14)=1,WEEKDAY(P14)=7),\"\",1))","v":""},{"$f":"IF(SUMPRODUCT(('Feiertage und Ferien'!$H$8:$H$13<=Q14)*('Feiertage und Ferien'!$I$8:$I$13>=Q14)),\"F\",IF(OR(WEEKDAY(Q14)=1,WEEKDAY(Q14)=7),\"\",1))","v":1},{"$f":"IF(SUMPRODUCT(('Feiertage und Ferien'!$H$8:$H$13<=R14)*('Feiertage und Ferien'!$I$8:$I$13>=R14)),\"F\",IF(OR(WEEKDAY(R14)=1,WEEKDAY(R14)=7),\"\",1))","v":1},{"$f":"IF(SUMPRODUCT(('Feiertage und Ferien'!$H$8:$H$13<=S14)*('Feiertage und Ferien'!$I$8:$I$13>=S14)),\"F\",IF(OR(WEEKDAY(S14)=1,WEEKDAY(S14)=7),\"\",1))","v":1},{"$f":"IF(SUMPRODUCT(('Feiertage und Ferien'!$H$8:$H$13<=T14)*('Feiertage und Ferien'!$I$8:$I$13>=T14)),\"F\",IF(OR(WEEKDAY(T14)=1,WEEKDAY(T14)=7),\"\",1))","v":1},{"$f":"IF(SUMPRODUCT(('Feiertage und Ferien'!$H$8:$H$13<=U14)*('Feiertage und Ferien'!$I$8:$I$13>=U14)),\"F\",IF(OR(WEEKDAY(U14)=1,WEEKDAY(U14)=7),\"\",1))","v":1},{"$f":"IF(SUMPRODUCT(('Feiertage und Ferien'!$H$8:$H$13<=V14)*('Feiertage und Ferien'!$I$8:$I$13>=V14)),\"F\",IF(OR(WEEKDAY(V14)=1,WEEKDAY(V14)=7),\"\",1))","v":""},{"$f":"IF(SUMPRODUCT(('Feiertage und Ferien'!$H$8:$H$13<=W14)*('Feiertage und Ferien'!$I$8:$I$13>=W14)),\"F\",IF(OR(WEEKDAY(W14)=1,WEEKDAY(W14)=7),\"\",1))","v":""},{"$f":"IF(SUMPRODUCT(('Feiertage und Ferien'!$H$8:$H$13<=X14)*('Feiertage und Ferien'!$I$8:$I$13>=X14)),\"F\",IF(OR(WEEKDAY(X14)=1,WEEKDAY(X14)=7),\"\",1))","v":1},{"$f":"IF(SUMPRODUCT(('Feiertage und Ferien'!$H$8:$H$13<=Y14)*('Feiertage und Ferien'!$I$8:$I$13>=Y14)),\"F\",IF(OR(WEEKDAY(Y14)=1,WEEKDAY(Y14)=7),\"\",1))","v":1},{"$f":"IF(SUMPRODUCT(('Feiertage und Ferien'!$H$8:$H$13<=Z14)*('Feiertage und Ferien'!$I$8:$I$13>=Z14)),\"F\",IF(OR(WEEKDAY(Z14)=1,WEEKDAY(Z14)=7),\"\",1))","v":1},{"$f":"IF(SUMPRODUCT(('Feiertage und Ferien'!$H$8:$H$13<=AA14)*('Feiertage und Ferien'!$I$8:$I$13>=AA14)),\"F\",IF(OR(WEEKDAY(AA14)=1,WEEKDAY(AA14)=7),\"\",1))","v":1},{"$f":"IF(SUMPRODUCT(('Feiertage und Ferien'!$H$8:$H$13<=AB14)*('Feiertage und Ferien'!$I$8:$I$13>=AB14)),\"F\",IF(OR(WEEKDAY(AB14)=1,WEEKDAY(AB14)=7),\"\",1))","v":1},{"$f":"IF(SUMPRODUCT(('Feiertage und Ferien'!$H$8:$H$13<=AC14)*('Feiertage und Ferien'!$I$8:$I$13>=AC14)),\"F\",IF(OR(WEEKDAY(AC14)=1,WEEKDAY(AC14)=7),\"\",1))","v":""},{"$f":"IF(SUMPRODUCT(('Feiertage und Ferien'!$H$8:$H$13<=AD14)*('Feiertage und Ferien'!$I$8:$I$13>=AD14)),\"F\",IF(OR(WEEKDAY(AD14)=1,WEEKDAY(AD14)=7),\"\",1))","v":""},{"$f":"IF(SUMPRODUCT(('Feiertage und Ferien'!$H$8:$H$13<=AE14)*('Feiertage und Ferien'!$I$8:$I$13>=AE14)),\"F\",IF(OR(WEEKDAY(AE14)=1,WEEKDAY(AE14)=7),\"\",1))","v":1},{"$f":"IF(SUMPRODUCT(('Feiertage und Ferien'!$H$8:$H$13<=AF14)*('Feiertage und Ferien'!$I$8:$I$13>=AF14)),\"F\",IF(OR(WEEKDAY(AF14)=1,WEEKDAY(AF14)=7),\"\",1))","v":""},{"$f":"COUNT(B15:AF15,\"<0.1\")","v":21},"Juni",{"$f":"Erfassung!L2+20%","v":1},{"$f":"ROUND(AG15*AI15/5,1)*5","v":21}]
[null,{"$f":"AE14+1","v":"2025-07-01"},{"$f":"B16+1","v":"2025-07-02"},"2025-07-03","2025-07-04","2025-07-05","2025-07-06","2025-07-07","2025-07-08","2025-07-09","2025-07-10","2025-07-11","2025-07-12","2025-07-13","2025-07-14","2025-07-15","2025-07-16","2025-07-17","2025-07-18","2025-07-19","2025-07-20","2025-07-21","2025-07-22","2025-07-23","2025-07-24","2025-07-25","2025-07-26","2025-07-27","2025-07-28","2025-07-29","2025-07-30","2025-07-31"]
["Juli",{"$f":"IF(SUMPRODUCT(('Feiertage und Ferien'!$H$8:$H$13<=B16)*('Feiertage und Ferien'!$I$8:$I$13>=B16)),\"F\",IF(OR(WEEKDAY(B16)=1,WEEKDAY(B16)=7),\"\",1))","v":1},{"$f":"IF(SUMPRODUCT(('Feiertage und Ferien'!$H$8:$H$13<=C16)*('Feiertage und Ferien'!$I$8:$I$13>=C16)),\"F\",IF(OR(WEEKDAY(C16)=1,WEEKDAY(C16)=7),\"\",1))","v":1},{"$f":"IF(SUMPRODUCT(('Feiertage und Ferien'!$H$8:$H$13<=D16)*('Feiertage und Ferien'!$I$8:$I$13>=D16)),\"F\",IF(OR(WEEKDAY(D16)=1,WEEKDAY(D16)=7),\"\",1))","v":1},{"$f":"IF(SUMPRODUCT(('Feiertage und Ferien'!$H$8:$H$13<=E16)*('Feiertage und Ferien'!$I$8:$I$13>=E16)),\"F\",IF(OR(WEEKDAY(E16)=1,WEEKDAY(E16)=7),\"\",1))","v":1},{"$f":"IF(SUMPRODUCT(('Feiertage und Ferien'!$H$8:$H$13<=F16)*('Feiertage und Ferien'!$I$8:$I$13>=F16)),\"F\",IF(OR(WEEKDAY(F16)=1,WEEKDAY(F16)=7),\"\",1))","v":"F"},{"$f":"IF(SUMPRODUCT(('Feiertage und Ferien'!$H$8:$H$13<=G16)*('Feiertage und Ferien'!$I$8:$I$13>=G16)),\"F\",IF(OR(WEEKDAY(G16)=1,WEEKDAY(G16)=7),\"\",1))","v":"F"},{"$f":"IF(SUMPRODUCT(('Feiertage und Ferien'!$H$8:$H$13<=H16)*('Feiertage und Ferien'!$I$8:$I$13>=H16)),\"F\",IF(OR(WEEKDAY(H16)=1,WEEKDAY(H16)=7),\"\",1))","v":"F"},{"$f":"IF(SUMPRODUCT(('Feiertage und Ferien'!$H$8:$H$13<=I16)*('Feiertage und Ferien'!$I$8:$I$13>=I16)),\"F\",IF(OR(WEEKDAY(I16)=1,WEEKDAY(I16)=7),\"\",1))","v":"F"},{"$f":"IF(SUMPRODUCT(('Feiertage und Ferien'!$H$8:$H$13<=J16)*('Feiertage und Ferien'!$I$8:$I$13>=J16)),\"F\",IF(OR(WEEKDAY(J16)=1,WEEKDAY(J16)=7),\"\",1))","v":"F"},{"$f":"IF(SUMPRODUCT(('Feiertage und Ferien'!$H$8:$H$13<=K16)*('Feiertage und Ferien'!$I$8:$I$13>=K16)),\"F\",IF(OR(WEEKDAY(K16)=1,WEEKDAY(K16)=7),\"\",1))","v":"F"},{"$f":"IF(SUMPRODUCT(('Feiertage und Ferien'!$H$8:$H$13<=L16)*('Feiertage und Ferien'!$I$8:$I$13>=L16)),\"F\",IF(OR(WEEKDAY(L16)=1,WEEKDAY(L16)=7),\"\",1))","v":"F"},{"$f":"IF(SUMPRODUCT(('Feiertage und Ferien'!$H$8:$H$13<=M16)*('Feiertage und Ferien'!$I$8:$I$13>=M16)),\"F\",IF(OR(WEEKDAY(M16)=1,WEEKDAY(M16)=7),\"\",1))","v":"F"},{"$f":"IF(SUMPRODUCT(('Feiertage und Ferien'!$H$8:$H$13<=N16)*('Feiertage und Ferien'!$I$8:$I$13>=N16)),\"F\",IF(OR(WEEKDAY(N16)=1,WEEKDAY(N16)=7),\"\",1))","v":"F"},{"$f":"IF(SUMPRODUCT(('Feiertage und Ferien'!$H$8:$H$13<=O16)*('Feiertage und Ferien'!$I$8:$I$13>=O16)),\"F\",IF(OR(WEEKDAY(O16)=1,WEEKDAY(O16)=7),\"\",1))","v":"F"},{"$f":"IF(SUMPRODUCT(('Feiertage und Ferien'!$H$8:$H$13<=P16)*('Feiertage und Ferien'!$I$8:$I$13>=P16)),\"F\",IF(OR(WEEKDAY(P16)=1,WEEKDAY(P16)=7),\"\",1))","v":"F"},{"$f":"IF(SUMPRODUCT(('Feiertage und Ferien'!$H$8:$H$13<=Q16)*('Feiertage und Ferien'!$I$8:$I$13>=Q16)),\"F\",IF(OR(WEEKDAY(Q16)=1,WEEKDAY(Q16)=7),\"\",1))","v":"F"},{"$f":"IF(SUMPRODUCT(('Feiertage und Ferien'!$H$8:$H$13<=R16)*('Feiertage und Ferien'!$I$8:$I$13>=R16)),\"F\",IF(OR(WEEKDAY(R16)=1,WEEKDAY(R16)=7),\"\",1))","v":"F"},{"$f":"IF(SUMPRODUCT(('Feiertage und Ferien'!$H$8:$H$13<=S16)*('Feiertage und Ferien'!$I$8:$I$13>=S16)),\"F\",IF(OR(WEEKDAY(S16)=1,WEEKDAY(S16)=7),\"\",1))","v":"F"},{"$f":"IF(SUMPRODUCT(('Feiertage und Ferien'!$H$8:$H$13<=T16)*('Feiertage und Ferien'!$I$8:$I$13>=T16)),\"F\",IF(OR(WEEKDAY(T16)=1,WEEKDAY(T16)=7),\"\",1))","v":"F"},{"$f":"IF(SUMPRODUCT(('Feiertage und Ferien'!$H$8:$H$13<=U16)*('Feiertage und Ferien'!$I$8:$I$13>=U16)),\"F\",IF(OR(WEEKDAY(U16)=1,WEEKDAY(U16)=7),\"\",1))","v":"F"},{"$f":"IF(SUMPRODUCT(('Feiertage und Ferien'!$H$8:$H$13<=V16)*('Feiertage und Ferien'!$I$8:$I$13>=V16)),\"F\",IF(OR(WEEKDAY(V16)=1,WEEKDAY(V16)=7),\"\",1))","v":"F"},{"$f":"IF(SUMPRODUCT(('Feiertage und Ferien'!$H$8:$H$13<=W16)*('Feiertage und Ferien'!$I$8:$I$13>=W16)),\"F\",IF(OR(WEEKDAY(W16)=1,WEEKDAY(W16)=7),\"\",1))","v":"F"},{"$f":"IF(SUMPRODUCT(('Feiertage und Ferien'!$H$8:$H$13<=X16)*('Feiertage und Ferien'!$I$8:$I$13>=X16)),\"F\",IF(OR(WEEKDAY(X16)=1,WEEKDAY(X16)=7),\"\",1))","v":"F"},{"$f":"IF(SUMPRODUCT(('Feiertage und Ferien'!$H$8:$H$13<=Y16)*('Feiertage und Ferien'!$I$8:$I$13>=Y16)),\"F\",IF(OR(WEEKDAY(Y16)=1,WEEKDAY(Y16)=7),\"\",1))","v":"F"},{"$f":"IF(SUMPRODUCT(('Feiertage und Ferien'!$H$8:$H$13<=Z16)*('Feiertage und Ferien'!$I$8:$I$13>=Z16)),\"F\",IF(OR(WEEKDAY(Z16)=1,WEEKDAY(Z16)=7),\"\",1))","v":"F"},{"$f":"IF(SUMPRODUCT(('Feiertage und Ferien'!$H$8:$H$13<=AA16)*('Feiertage und Ferien'!$I$8:$I$13>=AA16)),\"F\",IF(OR(WEEKDAY(AA16)=1,WEEKDAY(AA16)=7),\"\",1))","v":"F"},{"$f":"IF(SUMPRODUCT(('Feiertage und Ferien'!$H$8:$H$13<=AB16)*('Feiertage und Ferien'!$I$8:$I$13>=AB16)),\"F\",IF(OR(WEEKDAY(AB16)=1,WEEKDAY(AB16)=7),\"\",1))","v":"F"},{"$f":"IF(SUMPRODUCT(('Feiertage und Ferien'!$H$8:$H$13<=AC16)*('Feiertage und Ferien'!$I$8:$I$13>=AC16)),\"F\",IF(OR(WEEKDAY(AC16)=1,WEEKDAY(AC16)=7),\"\",1))","v":"F"},{"$f":"IF(SUMPRODUCT(('Feiertage und Ferien'!$H$8:$H$13<=AD16)*('Feiertage und Ferien'!$I$8:$I$13>=AD16)),\"F\",IF(OR(WEEKDAY(AD16)=1,WEEKDAY(AD16)=7),\"\",1))","v":"F"},{"$f":"IF(SUMPRODUCT(('Feiertage und Ferien'!$H$8:$H$13<=AE16)*('Feiertage und Ferien'!$I$8:$I$13>=AE16)),\"F\",IF(OR(WEEKDAY(AE16)=1,WEEKDAY(AE16)=7),\"\",1))","v":"F"},{"$f":"IF(SUMPRODUCT(('Feiertage und Ferien'!$H$8:$H$13<=AF16)*('Feiertage und Ferien'!$I$8:$I$13>=AF16)),\"F\",IF(OR(WEEKDAY(AF16)=1,WEEKDAY(AF16)=7),\"\",1))","v":"F"},{"$f":"COUNT(B17:AF17,\"<0.1\")","v":4},"Juli",{"$f":"Erfassung!M2+20%","v":1},{"$f":"ROUND(AG17*AI17/5,1)*5","v":4}]
[null,{"$f":"AF16+1","v":"2025-08-01"},{"$f":"B18+1","v":"2025-08-02"},"2025-08-03","2025-08-04","2025-08-05","2025-08-06","2025-08-07","2025-08-08","2025-08-09","2025-08-10","2025-08-11","2025-08-12","2025-08-13","2025-08-14","2025-08-15","2025-08-16","2025-08-17","2025-08-18","2025-08-19","2025-08-20","2025-08-21","2025-08-22","2025-08-23","2025-08-24","2025-08-25","2025-08-26","2025-08-27","2025-08-28","2025-08-29","2025-08-30","2025-08-31"]
["August",{"$f":"IF(SUMPRODUCT(('Feiertage und Ferien'!$H$8:$H$13<=B18)*('Feiertage und Ferien'!$I$8:$I$13>=B18)),\"F\",IF(OR(WEEKDAY(B18)=1,WEEKDAY(B18)=7),\"\",1))","v":"F"},{"$f":"IF(SUMPRODUCT(('Feiertage und Ferien'!$H$8:$H$13<=C18)*('Feiertage und Ferien'!$I$8:$I$13>=C18)),\"F\",IF(OR(WEEKDAY(C18)=1,WEEKDAY(C18)=7),\"\",1))","v":"F"},{"$f":"IF(SUMPRODUCT(('Feiertage und Ferien'!$H$8:$H$13<=D18)*('Feiertage und Ferien'!$I$8:$I$13>=D18)),\"F\",IF(OR(WEEKDAY(D18)=1,WEEKDAY(D18)=7),\"\",1))","v":"F"},{"$f":"IF(SUMPRODUCT(('Feiertage und Ferien'!$H$8:$H$13<=E18)*('Feiertage und Ferien'!$I$8:$I$13>=E18)),\"F\",IF(OR(WEEKDAY(E18)=1,WEEKDAY(E18)=7),\"\",1))","v":"F"},{"$f":"IF(SUMPRODUCT(('Feiertage und Ferien'!$H$8:$H$13<=F18)*('Feiertage und Ferien'!$I$8:$I$13>=F18)),\"F\",IF(OR(WEEKDAY(F18)=1,WEEKDAY(F18)=7),\"\",1))","v":"F"},{"$f":"IF(SUMPRODUCT(('Feiertage und Ferien'!$H$8:$H$13<=G18)*('Feiertage und Ferien'!$I$8:$I$13>=G18)),\"F\",IF(OR(WEEKDAY(G18)=1,WEEKDAY(G18)=7),\"\",1))","v":"F"},{"$f":"IF(SUMPRODUCT(('Feiertage und Ferien'!$H$8:$H$13<=H18)*('Feiertage und Ferien'!$I$8:$I$13>=H18)),\"F\",IF(OR(WEEKDAY(H18)=1,WEEKDAY(H18)=7),\"\",1))","v":"F"},{"$f":"IF(SUMPRODUCT(('Feiertage und Ferien'!$H$8:$H$13<=I18)*('Feiertage und Ferien'!$I$8:$I$13>=I18)),\"F\",IF(OR(WEEKDAY(I18)=1,WEEKDAY(I18)=7),\"\",1))","v":"F"},{"$f":"IF(SUMPRODUCT(('Feiertage und Ferien'!$H$8:$H$13<=J18)*('Feiertage und Ferien'!$I$8:$I$13>=J18)),\"F\",IF(OR(WEEKDAY(J18)=1,WEEKDAY(J18)=7),\"\",1))","v":"F"},{"$f":"IF(SUMPRODUCT(('Feiertage und Ferien'!$H$8:$H$13<=K18)*('Feiertage und Ferien'!$I$8:$I$13>=K18)),\"F\",IF(OR(WEEKDAY(K18)=1,WEEKDAY(K18)=7),\"\",1))","v":""},{"$f":"IF(SUMPRODUCT(('Feiertage und Ferien'!$H$8:$H$13<=L18)*('Feiertage und Ferien'!$I$8:$I$13>=L18)),\"F\",IF(OR(WEEKDAY(L18)=1,WEEKDAY(L18)=7),\"\",1))","v":1},{"$f":"IF(SUMPRODUCT(('Feiertage und Ferien'!$H$8:$H$13<=M18)*('Feiertage und Ferien'!$I$8:$I$13>=M18)),\"F\",IF(OR(WEEKDAY(M18)=1,WEEKDAY(M18)=7),\"\",1))","v":1},{"$f":"IF(SUMPRODUCT(('Feiertage und Ferien'!$H$8:$H$13<=N18)*('Feiertage und Ferien'!$I$8:$I$13>=N18)),\"F\",IF(OR(WEEKDAY(N18)=1,WEEKDAY(N18)=7),\"\",1))","v":1},{"$f":"IF(SUMPRODUCT(('Feiertage und Ferien'!$H$8:$H$13<=O18)*('Feiertage und Ferien'!$I$8:$I$13>=O18)),\"F\",IF(OR(WEEKDAY(O18)=1,WEEKDAY(O18)=7),\"\",1))","v":1},{"$f":"IF(SUMPRODUCT(('Feiertage und Ferien'!$H$8:$H$13<=P18)*('Feiertage und Ferien'!$I$8:$I$13>=P18)),\"F\",IF(OR(WEEKDAY(P18)=1,WEEKDAY(P18)=7),\"\",1))","v":1},{"$f":"IF(SUMPRODUCT(('Feiertage und Ferien'!$H$8:$H$13<=Q18)*('Feiertage und Ferien'!$I$8:$I$13>=Q18)),\"F\",IF(OR(WEEKDAY(Q18)=1,WEEKDAY(Q18)=7),\"\",1))","v":""},{"$f":"IF(SUMPRODUCT(('Feiertage und Ferien'!$H$8:$H$13<=R18)*('Feiertage und Ferien'!$I$8:$I$13>=R18)),\"F\",IF(OR(WEEKDAY(R18)=1,WEEKDAY(R18)=7),\"\",1))","v":""},{"$f":"IF(SUMPRODUCT(('Feiertage und Ferien'!$H$8:$H$13<=S18)*('Feiertage und Ferien'!$I$8:$I$13>=S18)),\"F\",IF(OR(WEEKDAY(S18)=1,WEEKDAY(S18)=7),\"\",1))","v":1},{"$f":"IF(SUMPRODUCT(('Feiertage und Ferien'!$H$8:$H$13<=T18)*('Feiertage und Ferien'!$I$8:$I$13>=T18)),\"F\",IF(OR(WEEKDAY(T18)=1,WEEKDAY(T18)=7),\"\",1))","v":1},{"$f":"IF(SUMPRODUCT(('Feiertage und Ferien'!$H$8:$H$13<=U18)*('Feiertage und Ferien'!$I$8:$I$13>=U18)),\"F\",IF(OR(WEEKDAY(U18)=1,WEEKDAY(U18)=7),\"\",1))","v":1},{"$f":"IF(SUMPRODUCT(('Feiertage und Ferien'!$H$8:$H$13<=V18)*('Feiertage und Ferien'!$I$8:$I$13>=V18)),\"F\",IF(OR(WEEKDAY(V18)=1,WEEKDAY(V18)=7),\"\",1))","v":1},{"$f":"IF(SUMPRODUCT(('Feiertage und Ferien'!$H$8:$H$13<=W18)*('Feiertage und Ferien'!$I$8:$I$13>=W18)),\"F\",IF(OR(WEEKDAY(W18)=1,WEEKDAY(W18)=7),\"\",1))","v":1},{"$f":"IF(SUMPRODUCT(('Feiertage und Ferien'!$H$8:$H$13<=X18)*('Feiertage und Ferien'!$I$8:$I$13>=X18)),\"F\",IF(OR(WEEKDAY(X18)=1,WEEKDAY(X18)=7),\"\",1))","v":""},{"$f":"IF(SUMPRODUCT(('Feiertage und Ferien'!$H$8:$H$13<=Y18)*('Feiertage und Ferien'!$I$8:$I$13>=Y18)),\"F\",IF(OR(WEEKDAY(Y18)=1,WEEKDAY(Y18)=7),\"\",1))","v":""},{"$f":"IF(SUMPRODUCT(('Feiertage und Ferien'!$H$8:$H$13<=Z18)*('Feiertage und Ferien'!$I$8:$I$13>=Z18)),\"F\",IF(OR(WEEKDAY(Z18)=1,WEEKDAY(Z18)=7),\"\",1))","v":1},{"$f":"IF(SUMPRODUCT(('Feiertage und Ferien'!$H$8:$H$13<=AA18)*('Feiertage und Ferien'!$I$8:$I$13>=AA18)),\"F\",IF(OR(WEEKDAY(AA18)=1,WEEKDAY(AA18)=7),\"\",1))","v":1},{"$f":"IF(SUMPRODUCT(('Feiertage und Ferien'!$H$8:$H$13<=AB18)*('Feiertage und Ferien'!$I$8:$I$13>=AB18)),\"F\",IF(OR(WEEKDAY(AB18)=1,WEEKDAY(AB18)=7),\"\",1))","v":1},{"$f":"IF(SUMPRODUCT(('Feiertage und Ferien'!$H$8:$H$13<=AC18)*('Feiertage und Ferien'!$I$8:$I$13>=AC18)),\"F\",IF(OR(WEEKDAY(AC18)=1,WEEKDAY(AC18)=7),\"\",1))","v":1},{"$f":"IF(SUMPRODUCT(('Feiertage und Ferien'!$H$8:$H$13<=AD18)*('Feiertage und Ferien'!$I$8:$I$13>=AD18)),\"F\",IF(OR(WEEKDAY(AD18)=1,WEEKDAY(AD18)=7),\"\",1))","v":1},{"$f":"IF(SUMPRODUCT(('Feiertage und Ferien'!$H$8:$H$13<=AE18)*('Feiertage und Ferien'!$I$8:$I$13>=AE18)),\"F\",IF(OR(WEEKDAY(AE18)=1,WEEKDAY(AE18)=7),\"\",1))","v":""},{"$f":"IF(SUMPRODUCT(('Feiertage und Ferien'!$H$8:$H$13<=AF18)*('Feiertage und Ferien'!$I$8:$I$13>=AF18)),\"F\",IF(OR(WEEKDAY(AF18)=1,WEEKDAY(AF18)=7),\"\",1))","v":""},{"$f":"COUNT(B19:AF19,\"<0.1\")","v":15},"August",{"$f":"Erfassung!N2+20%","v":1},{"$f":"ROUND(AG19*AI19/5,1)*5","v":15}]
[null,{"$f":"AF18+1","v":"2025-09-01"},{"$f":"B20+1","v":"2025-09-02"},"2025-09-03","2025-09-04","2025-09-05","2025-09-06","2025-09-07","2025-09-08","2025-09-09","2025-09-10","2025-09-11","2025-09-12","2025-09-13","2025-09-14","2025-09-15","2025-09-16","2025-09-17","2025-09-18","2025-09-19","2025-09-20","2025-09-21","2025-09-22","2025-09-23","2025-09-24","2025-09-25","2025-09-26","2025-09-27","2025-09-28","2025-09-29","2025-09-30"]
["September",{"$f":"IF(SUMPRODUCT(('Feiertage und Ferien'!$H$8:$H$13<=B20)*('Feiertage und Ferien'!$I$8:$I$13>=B20)),\"F\",IF(OR(WEEKDAY(B20)=1,WEEKDAY(B20)=7),\"\",1))","v":1},{"$f":"IF(SUMPRODUCT(('Feiertage und Ferien'!$H$8:$H$13<=C20)*('Feiertage und Ferien'!$I$8:$I$13>=C20)),\"F\",IF(OR(WEEKDAY(C20)=1,WEEKDAY(C20)=7),\"\",1))","v":1},{"$f":"IF(SUMPRODUCT(('Feiertage und Ferien'!$H$8:$H$13<=D20)*('Feiertage und Ferien'!$I$8:$I$13>=D20)),\"F\",IF(OR(WEEKDAY(D20)=1,WEEKDAY(D20)=7),\"\",1))","v":1},{"$f":"IF(SUMPRODUCT(('Feiertage und Ferien'!$H$8:$H$13<=E20)*('Feiertage und Ferien'!$I$8:$I$13>=E20)),\"F\",IF(OR(WEEKDAY(E20)=1,WEEKDAY(E20)=7),\"\",1))","v":1},{"$f":"IF(SUMPRODUCT(('Feiertage und Ferien'!$H$8:$H$13<=F20)*('Feiertage und Ferien'!$I$8:$I$13>=F20)),\"F\",IF(OR(WEEKDAY(F20)=1,WEEKDAY(F20)=7),\"\",1))","v":1},{"$f":"IF(SUMPRODUCT(('Feiertage und Ferien'!$H$8:$H$13<=G20)*('Feiertage und Ferien'!$I$8:$I$13>=G20)),\"F\",IF(OR(WEEKDAY(G20)=1,WEEKDAY(G20)=7),\"\",1))","v":""},{"$f":"IF(SUMPRODUCT(('Feiertage und Ferien'!$H$8:$H$13<=H20)*('Feiertage und Ferien'!$I$8:$I$13>=H20)),\"F\",IF(OR(WEEKDAY(H20)=1,WEEKDAY(H20)=7),\"\",1))","v":""},{"$f":"IF(SUMPRODUCT(('Feiertage und Ferien'!$H$8:$H$13<=I20)*('Feiertage und Ferien'!$I$8:$I$13>=I20)),\"F\",IF(OR(WEEKDAY(I20)=1,WEEKDAY(I20)=7),\"\",1))","v":1},{"$f":"IF(SUMPRODUCT(('Feiertage und Ferien'!$H$8:$H$13<=J20)*('Feiertage und Ferien'!$I$8:$I$13>=J20)),\"F\",IF(OR(WEEKDAY(J20)=1,WEEKDAY(J20)=7),\"\",1))","v":1},{"$f":"IF(SUMPRODUCT(('Feiertage und Ferien'!$H$8:$H$13<=K20)*('Feiertage und Ferien'!$I$8:$I$13>=K20)),\"F\",IF(OR(WEEKDAY(K20)=1,WEEKDAY(K20)=7),\"\",1))","v":1},{"$f":"IF(SUMPRODUCT(('Feiertage und Ferien'!$H$8:$H$13<=L20)*('Feiertage und Ferien'!$I$8:$I$13>=L20)),\"F\",IF(OR(WEEKDAY(L20)=1,WEEKDAY(L20)=7),\"\",1))","v":1},{"$f":"IF(SUMPRODUCT(('Feiertage und Ferien'!$H$8:$H$13<=M20)*('Feiertage und Ferien'!$I$8:$I$13>=M20)),\"F\",IF(OR(WEEKDAY(M20)=1,WEEKDAY(M20)=7),\"\",1))","v":1},{"$f":"IF(SUMPRODUCT(('Feiertage und Ferien'!$H$8:$H$13<=N20)*('Feiertage und Ferien'!$I$8:$I$13>=N20)),\"F\",IF(OR(WEEKDAY(N20)=1,WEEKDAY(N20)=7),\"\",1))","v":""},{"$f":"IF(SUMPRODUCT(('Feiertage und Ferien'!$H$8:$H$13<=O20)*('Feiertage und Ferien'!$I$8:$I$13>=O20)),\"F\",IF(OR(WEEKDAY(O20)=1,WEEKDAY(O20)=7),\"\",1))","v":""},{"$f":"IF(SUMPRODUCT(('Feiertage und Ferien'!$H$8:$H$13<=P20)*('Feiertage und Ferien'!$I$8:$I$13>=P20)),\"F\",IF(OR(WEEKDAY(P20)=1,WEEKDAY(P20)=7),\"\",1))","v":1},{"$f":"IF(SUMPRODUCT(('Feiertage und Ferien'!$H$8:$H$13<=Q20)*('Feiertage und Ferien'!$I$8:$I$13>=Q20)),\"F\",IF(OR(WEEKDAY(Q20)=1,WEEKDAY(Q20)=7),\"\",1))","v":1},{"$f":"IF(SUMPRODUCT(('Feiertage und Ferien'!$H$8:$H$13<=R20)*('Feiertage und Ferien'!$I$8:$I$13>=R20)),\"F\",IF(OR(WEEKDAY(R20)=1,WEEKDAY(R20)=7),\"\",1))","v":1},{"$f":"IF(SUMPRODUCT(('Feiertage und Ferien'!$H$8:$H$13<=S20)*('Feiertage und Ferien'!$I$8:$I$13>=S20)),\"F\",IF(OR(WEEKDAY(S20)=1,WEEKDAY(S20)=7),\"\",1))","v":1},{"$f":"IF(SUMPRODUCT(('Feiertage und Ferien'!$H$8:$H$13<=T20)*('Feiertage und Ferien'!$I$8:$I$13>=T20)),\"F\",IF(OR(WEEKDAY(T20)=1,WEEKDAY(T20)=7),\"\",1))","v":1},{"$f":"IF(SUMPRODUCT(('Feiertage und Ferien'!$H$8:$H$13<=U20)*('Feiertage und Ferien'!$I$8:$I$13>=U20)),\"F\",IF(OR(WEEKDAY(U20)=1,WEEKDAY(U20)=7),\"\",1))","v":""},{"$f":"IF(SUMPRODUCT(('Feiertage und Ferien'!$H$8:$H$13<=V20)*('Feiertage und Ferien'!$I$8:$I$13>=V20)),\"F\",IF(OR(WEEKDAY(V20)=1,WEEKDAY(V20)=7),\"\",1))","v":""},{"$f":"IF(SUMPRODUCT(('Feiertage und Ferien'!$H$8:$H$13<=W20)*('Feiertage und Ferien'!$I$8:$I$13>=W20)),\"F\",IF(OR(WEEKDAY(W20)=1,WEEKDAY(W20)=7),\"\",1))","v":1},{"$f":"IF(SUMPRODUCT(('Feiertage und Ferien'!$H$8:$H$13<=X20)*('Feiertage und Ferien'!$I$8:$I$13>=X20)),\"F\",IF(OR(WEEKDAY(X20)=1,WEEKDAY(X20)=7),\"\",1))","v":1},{"$f":"IF(SUMPRODUCT(('Feiertage und Ferien'!$H$8:$H$13<=Y20)*('Feiertage und Ferien'!$I$8:$I$13>=Y20)),\"F\",IF(OR(WEEKDAY(Y20)=1,WEEKDAY(Y20)=7),\"\",1))","v":1},{"$f":"IF(SUMPRODUCT(('Feiertage und Ferien'!$H$8:$H$13<=Z20)*('Feiertage und Ferien'!$I$8:$I$13>=Z20)),\"F\",IF(OR(WEEKDAY(Z20)=1,WEEKDAY(Z20)=7),\"\",1))","v":1},{"$f":"IF(SUMPRODUCT(('Feiertage und Ferien'!$H$8:$H$13<=AA20)*('Feiertage und Ferien'!$I$8:$I$13>=AA20)),\"F\",IF(OR(WEEKDAY(AA20)=1,WEEKDAY(AA20)=7),\"\",1))","v":1},{"$f":"IF(SUMPRODUCT(('Feiertage und Ferien'!$H$8:$H$13<=AB20)*('Feiertage und Ferien'!$I$8:$I$13>=AB20)),\"F\",IF(OR(WEEKDAY(AB20)=1,WEEKDAY(AB20)=7),\"\",1))","v":"F"},{"$f":"IF(SUMPRODUCT(('Feiertage und Ferien'!$H$8:$H$13<=AC20)*('Feiertage und Ferien'!$I$8:$I$13>=AC20)),\"F\",IF(OR(WEEKDAY(AC20)=1,WEEKDAY(AC20)=7),\"\",1))","v":"F"},{"$f":"IF(SUMPRODUCT(('Feiertage und Ferien'!$H$8:$H$13<=AD20)*('Feiertage und Ferien'!$I$8:$I$13>=AD20)),\"F\",IF(OR(WEEKDAY(AD20)=1,WEEKDAY(AD20)=7),\"\",1))","v":"F"},{"$f":"IF(SUMPRODUCT(('Feiertage und Ferien'!$H$8:$H$13<=AE20)*('Feiertage und Ferien'!$I$8:$I$13>=AE20)),\"F\",IF(OR(WEEKDAY(AE20)=1,WEEKDAY(AE20)=7),\"\",1))","v":"F"},{"$f":"IF(SUMPRODUCT(('Feiertage und Ferien'!$H$8:$H$13<=AF20)*('Feiertage und Ferien'!$I$8:$I$13>=AF20)),\"F\",IF(OR(WEEKDAY(AF20)=1,WEEKDAY(AF20)=7),\"\",1))","v":""},{"$f":"COUNT(B21:AF21,\"<0.1\")","v":20},"September",{"$f":"Erfassung!O2+20%","v":1},{"$f":"ROUND(AG21*AI21/5,1)*5","v":20}]
[null,{"$f":"AE20+1","v":"2025-10-01"},{"$f":"B22+1","v":"2025-10-02"},"2025-10-03","2025-10-04","2025-10-05","2025-10-06","2025-10-07","2025-10-08","2025-10-09","2025-10-10","2025-10-11","2025-10-12","2025-10-13","2025-10-14","2025-10-15","2025-10-16","2025-10-17","2025-10-18","2025-10-19","2025-10-20","2025-10-21","2025-10-22","2025-10-23","2025-10-24","2025-10-25","2025-10-26","2025-10-27","2025-10-28","2025-10-29","2025-10-30","2025-10-31"]
["Oktober",{"$f":"IF(SUMPRODUCT(('Feiertage und Ferien'!$H$8:$H$13<=B22)*('Feiertage und Ferien'!$I$8:$I$13>=B22)),\"F\",IF(OR(WEEKDAY(B22)=1,WEEKDAY(B22)=7),\"\",1))","v":"F"},{"$f":"IF(SUMPRODUCT(('Feiertage und Ferien'!$H$8:$H$13<=C22)*('Feiertage und Ferien'!$I$8:$I$13>=C22)),\"F\",IF(OR(WEEKDAY(C22)=1,WEEKDAY(C22)=7),\"\",1))","v":"F"},{"$f":"IF(SUMPRODUCT(('Feiertage und Ferien'!$H$8:$H$13<=D22)*('Feiertage und Ferien'!$I$8:$I$13>=D22)),\"F\",IF(OR(WEEKDAY(D22)=1,WEEKDAY(D22)=7),\"\",1))","v":"F"},{"$f":"IF(SUMPRODUCT(('Feiertage und Ferien'!$H$8:$H$13<=E22)*('Feiertage und Ferien'!$I$8:$I$13>=E22)),\"F\",IF(OR(WEEKDAY(E22)=1,WEEKDAY(E22)=7),\"\",1))","v":"F"},{"$f":"IF(SUMPRODUCT(('Feiertage und Ferien'!$H$8:$H$13<=F22)*('Feiertage und Ferien'!$I$8:$I$13>=F22)),\"F\",IF(OR(WEEKDAY(F22)=1,WEEKDAY(F22)=7),\"\",1))","v":"F"},{"$f":"IF(SUMPRODUCT(('Feiertage und Ferien'!$H$8:$H$13<=G22)*('Feiertage und Ferien'!$I$8:$I$13>=G22)),\"F\",IF(OR(WEEKDAY(G22)=1,WEEKDAY(G22)=7),\"\",1))","v":"F"},{"$f":"IF(SUMPRODUCT(('Feiertage und Ferien'!$H$8:$H$13<=H22)*('Feiertage und Ferien'!$I$8:$I$13>=H22)),\"F\",IF(OR(WEEKDAY(H22)=1,WEEKDAY(H22)=7),\"\",1))","v":"F"},{"$f":"IF(SUMPRODUCT(('Feiertage und Ferien'!$H$8:$H$13<=I22)*('Feiertage und Ferien'!$I$8:$I$13>=I22)),\"F\",IF(OR(WEEKDAY(I22)=1,WEEKDAY(I22)=7),\"\",1))","v":"F"},{"$f":"IF(SUMPRODUCT(('Feiertage und Ferien'!$H$8:$H$13<=J22)*('Feiertage und Ferien'!$I$8:$I$13>=J22)),\"F\",IF(OR(WEEKDAY(J22)=1,WEEKDAY(J22)=7),\"\",1))","v":"F"},{"$f":"IF(SUMPRODUCT(('Feiertage und Ferien'!$H$8:$H$13<=K22)*('Feiertage und Ferien'!$I$8:$I$13>=K22)),\"F\",IF(OR(WEEKDAY(K22)=1,WEEKDAY(K22)=7),\"\",1))","v":"F"},{"$f":"IF(SUMPRODUCT(('Feiertage und Ferien'!$H$8:$H$13<=L22)*('Feiertage und Ferien'!$I$8:$I$13>=L22)),\"F\",IF(OR(WEEKDAY(L22)=1,WEEKDAY(L22)=7),\"\",1))","v":"F"},{"$f":"IF(SUMPRODUCT(('Feiertage und Ferien'!$H$8:$H$13<=M22)*('Feiertage und Ferien'!$I$8:$I$13>=M22)),\"F\",IF(OR(WEEKDAY(M22)=1,WEEKDAY(M22)=7),\"\",1))","v":""},{"$f":"IF(SUMPRODUCT(('Feiertage und Ferien'!$H$8:$H$13<=N22)*('Feiertage und Ferien'!$I$8:$I$13>=N22)),\"F\",IF(OR(WEEKDAY(N22)=1,WEEKDAY(N22)=7),\"\",1))","v":1},{"$f":"IF(SUMPRODUCT(('Feiertage und Ferien'!$H$8:$H$13<=O22)*('Feiertage und Ferien'!$I$8:$I$13>=O22)),\"F\",IF(OR(WEEKDAY(O22)=1,WEEKDAY(O22)=7),\"\",1))","v":1},{"$f":"IF(SUMPRODUCT(('Feiertage und Ferien'!$H$8:$H$13<=P22)*('Feiertage und Ferien'!$I$8:$I$13>=P22)),\"F\",IF(OR(WEEKDAY(P22)=1,WEEKDAY(P22)=7),\"\",1))","v":1},{"$f":"IF(SUMPRODUCT(('Feiertage und Ferien'!$H$8:$H$13<=Q22)*('Feiertage und Ferien'!$I$8:$I$13>=Q22)),\"F\",IF(OR(WEEKDAY(Q22)=1,WEEKDAY(Q22)=7),\"\",1))","v":1},{"$f":"IF(SUMPRODUCT(('Feiertage und Ferien'!$H$8:$H$13<=R22)*('Feiertage und Ferien'!$I$8:$I$13>=R22)),\"F\",IF(OR(WEEKDAY(R22)=1,WEEKDAY(R22)=7),\"\",1))","v":1},{"$f":"IF(SUMPRODUCT(('Feiertage und Ferien'!$H$8:$H$13<=S22)*('Feiertage und Ferien'!$I$8:$I$13>=S22)),\"F\",IF(OR(WEEKDAY(S22)=1,WEEKDAY(S22)=7),\"\",1))","v":""},{"$f":"IF(SUMPRODUCT(('Feiertage und Ferien'!$H$8:$H$13<=T22)*('Feiertage und Ferien'!$I$8:$I$13>=T22)),\"F\",IF(OR(WEEKDAY(T22)=1,WEEKDAY(T22)=7),\"\",1))","v":""},{"$f":"IF(SUMPRODUCT(('Feiertage und Ferien'!$H$8:$H$13<=U22)*('Feiertage und Ferien'!$I$8:$I$13>=U22)),\"F\",IF(OR(WEEKDAY(U22)=1,WEEKDAY(U22)=7),\"\",1))","v":1},{"$f":"IF(SUMPRODUCT(('Feiertage und Ferien'!$H$8:$H$13<=V22)*('Feiertage und Ferien'!$I$8:$I$13>=V22)),\"F\",IF(OR(WEEKDAY(V22)=1,WEEKDAY(V22)=7),\"\",1))","v":1},{"$f":"IF(SUMPRODUCT(('Feiertage und Ferien'!$H$8:$H$13<=W22)*('Feiertage und Ferien'!$I$8:$I$13>=W22)),\"F\",IF(OR(WEEKDAY(W22)=1,WEEKDAY(W22)=7),\"\",1))","v":1},{"$f":"IF(SUMPRODUCT(('Feiertage und Ferien'!$H$8:$H$13<=X22)*('Feiertage und Ferien'!$I$8:$I$13>=X22)),\"F\",IF(OR(WEEKDAY(X22)=1,WEEKDAY(X22)=7),\"\",1))","v":1},{"$f":"IF(SUMPRODUCT(('Feiertage und Ferien'!$H$8:$H$13<=Y22)*('Feiertage und Ferien'!$I$8:$I$13>=Y22)),\"F\",IF(OR(WEEKDAY(Y22)=1,WEEKDAY(Y22)=7),\"\",1))","v":1},{"$f":"IF(SUMPRODUCT(('Feiertage und Ferien'!$H$8:$H$13<=Z22)*('Feiertage und Ferien'!$I$8:$I$13>=Z22)),\"F\",IF(OR(WEEKDAY(Z22)=1,WEEKDAY(Z22)=7),\"\",1))","v":""},{"$f":"IF(SUMPRODUCT(('Feiertage und Ferien'!$H$8:$H$13<=AA22)*('Feiertage und Ferien'!$I$8:$I$13>=AA22)),\"F\",IF(OR(WEEKDAY(AA22)=1,WEEKDAY(AA22)=7),\"\",1))","v":""},{"$f":"IF(SUMPRODUCT(('Feiertage und Ferien'!$H$8:$H$13<=AB22)*('Feiertage und Ferien'!$I$8:$I$13>=AB22)),\"F\",IF(OR(WEEKDAY(AB22)=1,WEEKDAY(AB22)=7),\"\",1))","v":1},{"$f":"IF(SUMPRODUCT(('Feiertage und Ferien'!$H$8:$H$13<=AC22)*('Feiertage und Ferien'!$I$8:$I$13>=AC22)),\"F\",IF(OR(WEEKDAY(AC22)=1,WEEKDAY(AC22)=7),\"\",1))","v":1},{"$f":"IF(SUMPRODUCT(('Feiertage und Ferien'!$H$8:$H$13<=AD22)*('Feiertage und Ferien'!$I$8:$I$13>=AD22)),\"F\",IF(OR(WEEKDAY(AD22)=1,WEEKDAY(AD22)=7),\"\",1))","v":1},{"$f":"IF(SUMPRODUCT(('Feiertage und Ferien'!$H$8:$H$13<=AE22)*('Feiertage und Ferien'!$I$8:$I$13>=AE22)),\"F\",IF(OR(WEEKDAY(AE22)=1,WEEKDAY(AE22)=7),\"\",1))","v":1},{"$f":"IF(SUMPRODUCT(('Feiertage und Ferien'!$H$8:$H$13<=AF22)*('Feiertage und Ferien'!$I$8:$I$13>=AF22)),\"F\",IF(OR(WEEKDAY(AF22)=1,WEEKDAY(AF22)=7),\"\",1))","v":1},{"$f":"COUNT(B23:AF23,\"<0.1\")","v":15},"Oktober",{"$f":"Erfassung!P2+20%","v":1},{"$f":"ROUND(AG23*AI23/5,1)*5","v":15}]
[null,{"$f":"AF22+1","v":"2025-11-01"},{"$f":"B24+1","v":"2025-11-02"},"2025-11-03","2025-11-04","2025-11-05","2025-11-06","2025-11-07","2025-11-08","2025-11-09","2025-11-10","2025-11-11","2025-11-12","2025-11-13","2025-11-14","2025-11-15","2025-11-16","2025-11-17","2025-11-18","2025-11-19","2025-11-20","2025-11-21","2025-11-22","2025-11-23","2025-11-24","2025-11-25","2025-11-26","2025-11-27","2025-11-28","2025-11-29","2025-11-30"]
["November",{"$f":"IF(SUMPRODUCT(('Feiertage und Ferien'!$H$8:$H$13<=B24)*('Feiertage und Ferien'!$I$8:$I$13>=B24)),\"F\",IF(OR(WEEKDAY(B24)=1,WEEKDAY(B24)=7),\"\",1))","v":""},{"$f":"IF(SUMPRODUCT(('Feiertage und Ferien'!$H$8:$H$13<=C24)*('Feiertage und Ferien'!$I$8:$I$13>=C24)),\"F\",IF(OR(WEEKDAY(C24)=1,WEEKDAY(C24)=7),\"\",1))","v":""},{"$f":"IF(SUMPRODUCT(('Feiertage und Ferien'!$H$8:$H$13<=D24)*('Feiertage und Ferien'!$I$8:$I$13>=D24)),\"F\",IF(OR(WEEKDAY(D24)=1,WEEKDAY(D24)=7),\"\",1))","v":1},{"$f":"IF(SUMPRODUCT(('Feiertage und Ferien'!$H$8:$H$13<=E24)*('Feiertage und Ferien'!$I$8:$I$13>=E24)),\"F\",IF(OR(WEEKDAY(E24)=1,WEEKDAY(E24)=7),\"\",1))","v":1},{"$f":"IF(SUMPRODUCT(('Feiertage und Ferien'!$H$8:$H$13<=F24)*('Feiertage und Ferien'!$I$8:$I$13>=F24)),\"F\",IF(OR(WEEKDAY(F24)=1,WEEKDAY(F24)=7),\"\",1))","v":1},{"$f":"IF(SUMPRODUCT(('Feiertage und Ferien'!$H$8:$H$13<=G24)*('Feiertage und Ferien'!$I$8:$I$13>=G24)),\"F\",IF(OR(WEEKDAY(G24)=1,WEEKDAY(G24)=7),\"\",1))","v":1},{"$f":"IF(SUMPRODUCT(('Feiertage und Ferien'!$H$8:$H$13<=H24)*('Feiertage und Ferien'!$I$8:$I$13>=H24)),\"F\",IF(OR(WEEKDAY(H24)=1,WEEKDAY(H24)=7),\"\",1))","v":1},{"$f":"IF(SUMPRODUCT(('Feiertage und Ferien'!$H$8:$H$13<=I24)*('Feiertage und Ferien'!$I$8:$I$13>=I24)),\"F\",IF(OR(WEEKDAY(I24)=1,WEEKDAY(I24)=7),\"\",1))","v":""},{"$f":"IF(SUMPRODUCT(('Feiertage und Ferien'!$H$8:$H$13<=J24)*('Feiertage und Ferien'!$I$8:$I$13>=J24)),\"F\",IF(OR(WEEKDAY(J24)=1,WEEKDAY(J24)=7),\"\",1))","v":""},{"$f":"IF(SUMPRODUCT(('Feiertage und Ferien'!$H$8:$H$13<=K24)*('Feiertage und Ferien'!$I$8:$I$13>=K24)),\"F\",IF(OR(WEEKDAY(K24)=1,WEEKDAY(K24)=7),\"\",1))","v":1},{"$f":"IF(SUMPRODUCT(('Feiertage und Ferien'!$H$8:$H$13<=L24)*('Feiertage und Ferien'!$I$8:$I$13>=L24)),\"F\",IF(OR(WEEKDAY(L24)=1,WEEKDAY(L24)=7),\"\",1))","v":1},{"$f":"IF(SUMPRODUCT(('Feiertage und Ferien'!$H$8:$H$13<=M24)*('Feiertage und Ferien'!$I$8:$I$13>=M24)),\"F\",IF(OR(WEEKDAY(M24)=1,WEEKDAY(M24)=7),\"\",1))","v":1},{"$f":"IF(SUMPRODUCT(('Feiertage und Ferien'!$H$8:$H$13<=N24)*('Feiertage und Ferien'!$I$8:$I$13>=N24)),\"F\",IF(OR(WEEKDAY(N24)=1,WEEKDAY(N24)=7),\"\",1))","v":1},{"$f":"IF(SUMPRODUCT(('Feiertage und Ferien'!$H$8:$H$13<=O24)*('Feiertage und Ferien'!$I$8:$I$13>=O24)),\"F\",IF(OR(WEEKDAY(O24)=1,WEEKDAY(O24)=7),\"\",1))","v":1},{"$f":"IF(SUMPRODUCT(('Feiertage und Ferien'!$H$8:$H$13<=P24)*('Feiertage und Ferien'!$I$8:$I$13>=P24)),\"F\",IF(OR(WEEKDAY(P24)=1,WEEKDAY(P24)=7),\"\",1))","v":""},{"$f":"IF(SUMPRODUCT(('Feiertage und Ferien'!$H$8:$H$13<=Q24)*('Feiertage und Ferien'!$I$8:$I$13>=Q24)),\"F\",IF(OR(WEEKDAY(Q24)=1,WEEKDAY(Q24)=7),\"\",1))","v":""},{"$f":"IF(SUMPRODUCT(('Feiertage und Ferien'!$H$8:$H$13<=R24)*('Feiertage und Ferien'!$I$8:$I$13>=R24)),\"F\",IF(OR(WEEKDAY(R24)=1,WEEKDAY(R24)=7),\"\",1))","v":1},{"$f":"IF(SUMPRODUCT(('Feiertage und Ferien'!$H$8:$H$13<=S24)*('Feiertage und Ferien'!$I$8:$I$13>=S24)),\"F\",IF(OR(WEEKDAY(S24)=1,WEEKDAY(S24)=7),\"\",1))","v":1},{"$f":"IF(SUMPRODUCT(('Feiertage und Ferien'!$H$8:$H$13<=T24)*('Feiertage und Ferien'!$I$8:$I$13>=T24)),\"F\",IF(OR(WEEKDAY(T24)=1,WEEKDAY(T24)=7),\"\",1))","v":1},{"$f":"IF(SUMPRODUCT(('Feiertage und Ferien'!$H$8:$H$13<=U24)*('Feiertage und Ferien'!$I$8:$I$13>=U24)),\"F\",IF(OR(WEEKDAY(U24)=1,WEEKDAY(U24)=7),\"\",1))","v":1},{"$f":"IF(SUMPRODUCT(('Feiertage und Ferien'!$H$8:$H$13<=V24)*('Feiertage und Ferien'!$I$8:$I$13>=V24)),\"F\",IF(OR(WEEKDAY(V24)=1,WEEKDAY(V24)=7),\"\",1))","v":1},{"$f":"IF(SUMPRODUCT(('Feiertage und Ferien'!$H$8:$H$13<=W24)*('Feiertage und Ferien'!$I$8:$I$13>=W24)),\"F\",IF(OR(WEEKDAY(W24)=1,WEEKDAY(W24)=7),\"\",1))","v":""},{"$f":"IF(SUMPRODUCT(('Feiertage und Ferien'!$H$8:$H$13<=X24)*('Feiertage und Ferien'!$I$8:$I$13>=X24)),\"F\",IF(OR(WEEKDAY(X24)=1,WEEKDAY(X24)=7),\"\",1))","v":""},{"$f":"IF(SUMPRODUCT(('Feiertage und Ferien'!$H$8:$H$13<=Y24)*('Feiertage und Ferien'!$I$8:$I$13>=Y24)),\"F\",IF(OR(WEEKDAY(Y24)=1,WEEKDAY(Y24)=7),\"\",1))","v":1},{"$f":"IF(SUMPRODUCT(('Feiertage und Ferien'!$H$8:$H$13<=Z24)*('Feiertage und Ferien'!$I$8:$I$13>=Z24)),\"F\",IF(OR(WEEKDAY(Z24)=1,WEEKDAY(Z24)=7),\"\",1))","v":1},{"$f":"IF(SUMPRODUCT(('Feiertage und Ferien'!$H$8:$H$13<=AA24)*('Feiertage und Ferien'!$I$8:$I$13>=AA24)),\"F\",IF(OR(WEEKDAY(AA24)=1,WEEKDAY(AA24)=7),\"\",1))","v":1},{"$f":"IF(SUMPRODUCT(('Feiertage und Ferien'!$H$8:$H$13<=AB24)*('Feiertage und Ferien'!$I$8:$I$13>=AB24)),\"F\",IF(OR(WEEKDAY(AB24)=1,WEEKDAY(AB24)=7),\"\",1))","v":1},{"$f":"IF(SUMPRODUCT(('Feiertage und Ferien'!$H$8:$H$13<=AC24)*('Feiertage und Ferien'!$I$8:$I$13>=AC24)),\"F\",IF(OR(WEEKDAY(AC24)=1,WEEKDAY(AC24)=7),\"\",1))","v":1},{"$f":"IF(SUMPRODUCT(('Feiertage und Ferien'!$H$8:$H$13<=AD24)*('Feiertage und Ferien'!$I$8:$I$13>=AD24)),\"F\",IF(OR(WEEKDAY(AD24)=1,WEEKDAY(AD24)=7),\"\",1))","v":""},{"$f":"IF(SUMPRODUCT(('Feiertage und Ferien'!$H$8:$H$13<=AE24)*('Feiertage und Ferien'!$I$8:$I$13>=AE24)),\"F\",IF(OR(WEEKDAY(AE24)=1,WEEKDAY(AE24)=7),\"\",1))","v":""},{"$f":"IF(SUMPRODUCT(('Feiertage und Ferien'!$H$8:$H$13<=AF24)*('Feiertage und Ferien'!$I$8:$I$13>=AF24)),\"F\",IF(OR(WEEKDAY(AF24)=1,WEEKDAY(AF24)=7),\"\",1))","v":""},{"$f":"COUNT(B25:AF25,\"<0.1\")","v":20},"November",{"$f":"Erfassung!Q2+20%","v":1},{"$f":"ROUND(AG25*AI25/5,1)*5","v":20}]
[null,{"$f":"AE24+1","v":"2025-12-01"},{"$f":"B26+1","v":"2025-12-02"},"2025-12-03","2025-12-04","2025-12-05","2025-12-06","2025-12-07","2025-12-08","2025-12-09","2025-12-10","2025-12-11","2025-12-12","2025-12-13","2025-12-14","2025-12-15","2025-12-16","2025-12-17","2025-12-18","2025-12-19","2025-12-20","2025-12-21","2025-12-22","2025-12-23","2025-12-24","2025-12-25","2025-12-26","2025-12-27","2025-12-28","2025-12-29","2025-12-30","2025-12-31"]
["Dezember",{"$f":"IF(SUMPRODUCT(('Feiertage und Ferien'!$H$8:$H$13<=B26)*('Feiertage und Ferien'!$I$8:$I$13>=B26)),\"F\",IF(OR(WEEKDAY(B26)=1,WEEKDAY(B26)=7),\"\",1))","v":1},{"$f":"IF(SUMPRODUCT(('Feiertage und Ferien'!$H$8:$H$13<=C26)*('Feiertage und Ferien'!$I$8:$I$13>=C26)),\"F\",IF(OR(WEEKDAY(C26)=1,WEEKDAY(C26)=7),\"\",1))","v":1},{"$f":"IF(SUMPRODUCT(('Feiertage und Ferien'!$H$8:$H$13<=D26)*('Feiertage und Ferien'!$I$8:$I$13>=D26)),\"F\",IF(OR(WEEKDAY(D26)=1,WEEKDAY(D26)=7),\"\",1))","v":1},{"$f":"IF(SUMPRODUCT(('Feiertage und Ferien'!$H$8:$H$13<=E26)*('Feiertage und Ferien'!$I$8:$I$13>=E26)),\"F\",IF(OR(WEEKDAY(E26)=1,WEEKDAY(E26)=7),\"\",1))","v":1},{"$f":"IF(SUMPRODUCT(('Feiertage und Ferien'!$H$8:$H$13<=F26)*('Feiertage und Ferien'!$I$8:$I$13>=F26)),\"F\",IF(OR(WEEKDAY(F26)=1,WEEKDAY(F26)=7),\"\",1))","v":1},{"$f":"IF(SUMPRODUCT(('Feiertage und Ferien'!$H$8:$H$13<=G26)*('Feiertage und Ferien'!$I$8:$I$13>=G26)),\"F\",IF(OR(WEEKDAY(G26)=1,WEEKDAY(G26)=7),\"\",1))","v":""},{"$f":"IF(SUMPRODUCT(('Feiertage und Ferien'!$H$8:$H$13<=H26)*('Feiertage und Ferien'!$I$8:$I$13>=H26)),\"F\",IF(OR(WEEKDAY(H26)=1,WEEKDAY(H26)=7),\"\",1))","v":""},{"$f":"IF(SUMPRODUCT(('Feiertage und Ferien'!$H$8:$H$13<=I26)*('Feiertage und Ferien'!$I$8:$I$13>=I26)),\"F\",IF(OR(WEEKDAY(I26)=1,WEEKDAY(I26)=7),\"\",1))","v":1},{"$f":"IF(SUMPRODUCT(('Feiertage und Ferien'!$H$8:$H$13<=J26)*('Feiertage und Ferien'!$I$8:$I$13>=J26)),\"F\",IF(OR(WEEKDAY(J26)=1,WEEKDAY(J26)=7),\"\",1))","v":1},{"$f":"IF(SUMPRODUCT(('Feiertage und Ferien'!$H$8:$H$13<=K26)*('Feiertage und Ferien'!$I$8:$I$13>=K26)),\"F\",IF(OR(WEEKDAY(K26)=1,WEEKDAY(K26)=7),\"\",1))","v":1},{"$f":"IF(SUMPRODUCT(('Feiertage und Ferien'!$H$8:$H$13<=L26)*('Feiertage und Ferien'!$I$8:$I$13>=L26)),\"F\",IF(OR(WEEKDAY(L26)=1,WEEKDAY(L26)=7),\"\",1))","v":1},{"$f":"IF(SUMPRODUCT(('Feiertage und Ferien'!$H$8:$H$13<=M26)*('Feiertage und Ferien'!$I$8:$I$13>=M26)),\"F\",IF(OR(WEEKDAY(M26)=1,WEEKDAY(M26)=7),\"\",1))","v":1},{"$f":"IF(SUMPRODUCT(('Feiertage und Ferien'!$H$8:$H$13<=N26)*('Feiertage und Ferien'!$I$8:$I$13>=N26)),\"F\",IF(OR(WEEKDAY(N26)=1,WEEKDAY(N26)=7),\"\",1))","v":""},{"$f":"IF(SUMPRODUCT(('Feiertage und Ferien'!$H$8:$H$13<=O26)*('Feiertage und Ferien'!$I$8:$I$13>=O26)),\"F\",IF(OR(WEEKDAY(O26)=1,WEEKDAY(O26)=7),\"\",1))","v":""},{"$f":"IF(SUMPRODUCT(('Feiertage und Ferien'!$H$8:$H$13<=P26)*('Feiertage und Ferien'!$I$8:$I$13>=P26)),\"F\",IF(OR(WEEKDAY(P26)=1,WEEKDAY(P26)=7),\"\",1))","v":1},{"$f":"IF(SUMPRODUCT(('Feiertage und Ferien'!$H$8:$H$13<=Q26)*('Feiertage und Ferien'!$I$8:$I$13>=Q26)),\"F\",IF(OR(WEEKDAY(Q26)=1,WEEKDAY(Q26)=7),\"\",1))","v":1},{"$f":"IF(SUMPRODUCT(('Feiertage und Ferien'!$H$8:$H$13<=R26)*('Feiertage und Ferien'!$I$8:$I$13>=R26)),\"F\",IF(OR(WEEKDAY(R26)=1,WEEKDAY(R26)=7),\"\",1))","v":1},{"$f":"IF(SUMPRODUCT(('Feiertage und Ferien'!$H$8:$H$13<=S26)*('Feiertage und Ferien'!$I$8:$I$13>=S26)),\"F\",IF(OR(WEEKDAY(S26)=1,WEEKDAY(S26)=7),\"\",1))","v":1},{"$f":"IF(SUMPRODUCT(('Feiertage und Ferien'!$H$8:$H$13<=T26)*('Feiertage und Ferien'!$I$8:$I$13>=T26)),\"F\",IF(OR(WEEKDAY(T26)=1,WEEKDAY(T26)=7),\"\",1))","v":1},{"$f":"IF(SUMPRODUCT(('Feiertage und Ferien'!$H$8:$H$13<=U26)*('Feiertage und Ferien'!$I$8:$I$13>=U26)),\"F\",IF(OR(WEEKDAY(U26)=1,WEEKDAY(U26)=7),\"\",1))","v":"F"},{"$f":"IF(SUMPRODUCT(('Feiertage und Ferien'!$H$8:$H$13<=V26)*('Feiertage und Ferien'!$I$8:$I$13>=V26)),\"F\",IF(OR(WEEKDAY(V26)=1,WEEKDAY(V26)=7),\"\",1))","v":"F"},{"$f":"IF(SUMPRODUCT(('Feiertage und Ferien'!$H$8:$H$13<=W26)*('Feiertage und Ferien'!$I$8:$I$13>=W26)),\"F\",IF(OR(WEEKDAY(W26)=1,WEEKDAY(W26)=7),\"\",1))","v":"F"},{"$f":"IF(SUMPRODUCT(('Feiertage und Ferien'!$H$8:$H$13<=X26)*('Feiertage und Ferien'!$I$8:$I$13>=X26)),\"F\",IF(OR(WEEKDAY(X26)=1,WEEKDAY(X26)=7),\"\",1))","v":"F"},{"$f":"IF(SUMPRODUCT(('Feiertage und Ferien'!$H$8:$H$13<=Y26)*('Feiertage und Ferien'!$I$8:$I$13>=Y26)),\"F\",IF(OR(WEEKDAY(Y26)=1,WEEKDAY(Y26)=7),\"\",1))","v":"F"},{"$f":"IF(SUMPRODUCT(('Feiertage und Ferien'!$H$8:$H$13<=Z26)*('Feiertage und Ferien'!$I$8:$I$13>=Z26)),\"F\",IF(OR(WEEKDAY(Z26)=1,WEEKDAY(Z26)=7),\"\",1))","v":"F"},{"$f":"IF(SUMPRODUCT(('Feiertage und Ferien'!$H$8:$H$13<=AA26)*('Feiertage und Ferien'!$I$8:$I$13>=AA26)),\"F\",IF(OR(WEEKDAY(AA26)=1,WEEKDAY(AA26)=7),\"\",1))","v":"F"},{"$f":"IF(SUMPRODUCT(('Feiertage und Ferien'!$H$8:$H$13<=AB26)*('Feiertage und Ferien'!$I$8:$I$13>=AB26)),\"F\",IF(OR(WEEKDAY(AB26)=1,WEEKDAY(AB26)=7),\"\",1))","v":"F"},{"$f":"IF(SUMPRODUCT(('Feiertage und Ferien'!$H$8:$H$13<=AC26)*('Feiertage und Ferien'!$I$8:$I$13>=AC26)),\"F\",IF(OR(WEEKDAY(AC26)=1,WEEKDAY(AC26)=7),\"\",1))","v":"F"},{"$f":"IF(SUMPRODUCT(('Feiertage und Ferien'!$H$8:$H$13<=AD26)*('Feiertage und Ferien'!$I$8:$I$13>=AD26)),\"F\",IF(OR(WEEKDAY(AD26)=1,WEEKDAY(AD26)=7),\"\",1))","v":"F"},{"$f":"IF(SUMPRODUCT(('Feiertage und Ferien'!$H$8:$H$13<=AE26)*('Feiertage und Ferien'!$I$8:$I$13>=AE26)),\"F\",IF(OR(WEEKDAY(AE26)=1,WEEKDAY(AE26)=7),\"\",1))","v":"F"},{"$f":"IF(SUMPRODUCT(('Feiertage und Ferien'!$H$8:$H$13<=AF26)*('Feiertage und Ferien'!$I$8:$I$13>=AF26)),\"F\",IF(OR(WEEKDAY(AF26)=1,WEEKDAY(AF26)=7),\"\",1))","v":"F"},{"$f":"COUNT(B27:AF27,\"<0.1\")","v":15},"Dezember",{"$f":"Erfassung!R2+20%","v":1},{"$f":"ROUND(AG27*AI27/5,1)*5","v":15}]
[]
["Legende:",null,"Ferien",null,null,null,"Arbeitstage",null,null,null,"Wochenende",null,null,"F","Feiertage"]
[]
[]
[]
[null,null,null,null,null,null,null,"Die roten Resultate unter ",null,null,null,null,null,null,null,"https://ssa-app.ch/SchoolHours",null,null,null,null,null,null,null,null,null,null,null,"im ssa-app/DossierManager erfassen."]